{"text_format":"1","workbook":"xlsx","n_sheets":22,"sheets":["Accueil","Charts","synthèse","SOLAIRE","Tarif combustible","ETIQUETTES","Pont thermique","surface auto","Chauffage","Calcul","Saisies","Liste communes","aide","Ubat","LISTE","Apports solaires","BDD typo","matériaux","Ventilation","ECS","RG","macro"],"not_rendered":{"charts":14,"images":43,"macros":1,"external_links":0,"defined_names":42,"comments":3,"pivot_tables":0},"unopened":[],"bounds":{"document_bytes":16777216,"sheet_cells":100000,"rows_first":2000,"rows_last":500,"rows_between":2000,"halvings":0,"cell_chars":16384,"cell_head_chars":4096},"cells_cut":0,"cells_raw":0,"read":"whole","date_system":"1900"}

{"sheet":"Accueil","index":0,"n_rows":33,"n_cols":11,"rows_kept":33,"cut":false,"hidden":true,"merged":[[4,2,4,10],[7,6,10,9],[12,6,15,9]]}
["£"]
[]
[]
[]
[null,null,"Outil de calcul des consommations en méthode mensuelle"]
[]
[]
[null,null,null,null,null,null,"Saisie simple, en 10 questions, pour estimer le niveau de consomations d'un bâtiment"]
[]
[]
[]
[]
[null,null,null,null,null,null,"Saisie plus fine, intègrant un metré précis des parois"]
[]
[]
[]
[]
[]
[]
[]
[]
[]
[]
[]
[]
[]
[]
[]
[]
[]
[]
[]
[null,null,null,null,null,null,null,null,null,null,"V 4.7"]

{"sheet":"Charts","index":1,"n_rows":33,"n_cols":36,"rows_kept":33,"cut":false,"hidden":true,"merged":[]}
["Ubat projet",{"$f":"Ubat!B39","v":0},null,null,null,null,null,null,null,null,null,null,null,null,null,null,null,null,null,null,null,null,null,null,{"$f":"Chauffage!A5","v":"Mois"},"Apports solaires (verticaux)",{"$f":"Chauffage!C5","v":"apports eclairage + hommes"},{"$f":"Chauffage!D5","v":"q"},"Temp ext moyenne",{"$f":"Chauffage!F5","v":"dt"},{"$f":"Chauffage!G5","v":"apports pertes"},{"$f":"Chauffage!H5","v":"apports tot"},{"$f":"Chauffage!I5","v":"n"},{"$f":"Chauffage!J5","v":"dju"},"Bilan besoins-apports","Besoin de chauffage"]
[{"$f":"Ubat!A43","v":"Ubât base"},{"$f":"Ubat!B43","v":{"$error":"#VALUE!"}},null,null,null,null,null,null,null,null,null,null,null,null,null,null,null,null,null,null,null,null,null,null,{"$f":"Chauffage!A6","v":"Janvier"},{"$f":"Chauffage!B6","v":{"$error":"#VALUE!"}},{"$f":"Chauffage!C6","v":0},{"$f":"Chauffage!D6","v":{"$error":"#VALUE!"}},{"$f":"Chauffage!E6","v":{"$error":"#VALUE!"}},{"$f":"Chauffage!F6","v":{"$error":"#VALUE!"}},{"$f":"Chauffage!G6","v":{"$error":"#VALUE!"}},{"$f":"Chauffage!H6","v":{"$error":"#VALUE!"}},{"$f":"Chauffage!I6","v":{"$error":"#VALUE!"}},{"$f":"Chauffage!J6","v":{"$error":"#VALUE!"}},{"$f":"Chauffage!K6","v":{"$error":"#VALUE!"}},{"$f":"Chauffage!L6","v":{"$error":"#VALUE!"}}]
["Ubat ref rt2005",{"$f":"Ubat!B41","v":{"$error":"#VALUE!"}},null,null,null,null,null,null,null,null,null,null,null,null,null,null,null,null,null,null,null,null,null,null,{"$f":"Chauffage!A7","v":"Février"},{"$f":"Chauffage!B7","v":{"$error":"#VALUE!"}},{"$f":"Chauffage!C7","v":0},{"$f":"Chauffage!D7","v":{"$error":"#VALUE!"}},{"$f":"Chauffage!E7","v":{"$error":"#VALUE!"}},{"$f":"Chauffage!F7","v":{"$error":"#VALUE!"}},{"$f":"Chauffage!G7","v":{"$error":"#VALUE!"}},{"$f":"Chauffage!H7","v":{"$error":"#VALUE!"}},{"$f":"Chauffage!I7","v":{"$error":"#VALUE!"}},{"$f":"Chauffage!J7","v":{"$error":"#VALUE!"}},{"$f":"Chauffage!K7","v":{"$error":"#VALUE!"}},{"$f":"Chauffage!L7","v":{"$error":"#VALUE!"}}]
["Ubat max RT 2005",{"$f":"Ubat!B45","v":{"$error":"#VALUE!"}},null,null,null,null,null,null,null,null,null,null,null,null,null,null,null,null,null,null,null,null,null,null,{"$f":"Chauffage!A8","v":"Mars"},{"$f":"Chauffage!B8","v":{"$error":"#VALUE!"}},{"$f":"Chauffage!C8","v":0},{"$f":"Chauffage!D8","v":{"$error":"#VALUE!"}},{"$f":"Chauffage!E8","v":{"$error":"#VALUE!"}},{"$f":"Chauffage!F8","v":{"$error":"#VALUE!"}},{"$f":"Chauffage!G8","v":{"$error":"#VALUE!"}},{"$f":"Chauffage!H8","v":{"$error":"#VALUE!"}},{"$f":"Chauffage!I8","v":{"$error":"#VALUE!"}},{"$f":"Chauffage!J8","v":{"$error":"#VALUE!"}},{"$f":"Chauffage!K8","v":{"$error":"#VALUE!"}},{"$f":"Chauffage!L8","v":{"$error":"#VALUE!"}}]
["Ubat max BBC",{"$f":"B4-(B4*0.3)","v":{"$error":"#VALUE!"}},null,null,null,null,null,null,null,null,null,null,null,null,null,null,null,null,null,null,null,null,null,null,{"$f":"Chauffage!A9","v":"Avril"},{"$f":"Chauffage!B9","v":{"$error":"#VALUE!"}},{"$f":"Chauffage!C9","v":0},{"$f":"Chauffage!D9","v":{"$error":"#VALUE!"}},{"$f":"Chauffage!E9","v":{"$error":"#VALUE!"}},{"$f":"Chauffage!F9","v":{"$error":"#VALUE!"}},{"$f":"Chauffage!G9","v":{"$error":"#VALUE!"}},{"$f":"Chauffage!H9","v":{"$error":"#VALUE!"}},{"$f":"Chauffage!I9","v":{"$error":"#VALUE!"}},{"$f":"Chauffage!J9","v":{"$error":"#VALUE!"}},{"$f":"Chauffage!K9","v":{"$error":"#VALUE!"}},{"$f":"Chauffage!L9","v":{"$error":"#VALUE!"}}]
[null,null,null,null,null,null,null,null,null,null,null,null,null,null,null,null,null,null,null,null,null,null,null,null,{"$f":"Chauffage!A10","v":"Mai"},{"$f":"Chauffage!B10","v":{"$error":"#VALUE!"}},{"$f":"Chauffage!C10","v":0},{"$f":"Chauffage!D10","v":{"$error":"#VALUE!"}},{"$f":"Chauffage!E10","v":{"$error":"#VALUE!"}},{"$f":"Chauffage!F10","v":{"$error":"#VALUE!"}},{"$f":"Chauffage!G10","v":{"$error":"#VALUE!"}},{"$f":"Chauffage!H10","v":{"$error":"#VALUE!"}},{"$f":"Chauffage!I10","v":{"$error":"#VALUE!"}},{"$f":"Chauffage!J10","v":{"$error":"#VALUE!"}},{"$f":"Chauffage!K10","v":{"$error":"#VALUE!"}},{"$f":"Chauffage!L10","v":{"$error":"#VALUE!"}}]
[null,null,null,null,null,null,null,null,null,null,null,null,null,null,null,null,null,null,null,null,null,null,null,null,{"$f":"Chauffage!A11","v":"Juin"},{"$f":"Chauffage!B11","v":{"$error":"#VALUE!"}},{"$f":"Chauffage!C11","v":0},{"$f":"Chauffage!D11","v":{"$error":"#VALUE!"}},{"$f":"Chauffage!E11","v":{"$error":"#VALUE!"}},{"$f":"Chauffage!F11","v":{"$error":"#VALUE!"}},{"$f":"Chauffage!G11","v":{"$error":"#VALUE!"}},{"$f":"Chauffage!H11","v":{"$error":"#VALUE!"}},{"$f":"Chauffage!I11","v":{"$error":"#VALUE!"}},{"$f":"Chauffage!J11","v":{"$error":"#VALUE!"}},{"$f":"Chauffage!K11","v":{"$error":"#VALUE!"}},{"$f":"Chauffage!L11","v":{"$error":"#VALUE!"}}]
["Ubat de référence RT 2005",null,null,null,null,null,null,null,null,null,null,null,null,null,null,null,null,null,null,null,null,null,null,null,{"$f":"Chauffage!A12","v":"Juillet"},{"$f":"Chauffage!B12","v":{"$error":"#VALUE!"}},{"$f":"Chauffage!C12","v":0},{"$f":"Chauffage!D12","v":{"$error":"#VALUE!"}},{"$f":"Chauffage!E12","v":{"$error":"#VALUE!"}},{"$f":"Chauffage!F12","v":{"$error":"#VALUE!"}},{"$f":"Chauffage!G12","v":{"$error":"#VALUE!"}},{"$f":"Chauffage!H12","v":{"$error":"#VALUE!"}},{"$f":"Chauffage!I12","v":{"$error":"#VALUE!"}},{"$f":"Chauffage!J12","v":{"$error":"#VALUE!"}},{"$f":"Chauffage!K12","v":{"$error":"#VALUE!"}},{"$f":"Chauffage!L12","v":{"$error":"#VALUE!"}}]
[null,null,null,null,null,null,null,null,null,null,null,null,null,null,null,null,null,null,null,null,null,null,null,null,{"$f":"Chauffage!A13","v":"Août"},{"$f":"Chauffage!B13","v":{"$error":"#VALUE!"}},{"$f":"Chauffage!C13","v":0},{"$f":"Chauffage!D13","v":{"$error":"#VALUE!"}},{"$f":"Chauffage!E13","v":{"$error":"#VALUE!"}},{"$f":"Chauffage!F13","v":{"$error":"#VALUE!"}},{"$f":"Chauffage!G13","v":{"$error":"#VALUE!"}},{"$f":"Chauffage!H13","v":{"$error":"#VALUE!"}},{"$f":"Chauffage!I13","v":{"$error":"#VALUE!"}},{"$f":"Chauffage!J13","v":{"$error":"#VALUE!"}},{"$f":"Chauffage!K13","v":{"$error":"#VALUE!"}},{"$f":"Chauffage!L13","v":{"$error":"#VALUE!"}}]
[null,null,null,null,null,null,null,null,null,null,null,null,null,null,null,null,null,null,null,null,null,null,null,null,{"$f":"Chauffage!A14","v":"Septembre"},{"$f":"Chauffage!B14","v":{"$error":"#VALUE!"}},{"$f":"Chauffage!C14","v":0},{"$f":"Chauffage!D14","v":{"$error":"#VALUE!"}},{"$f":"Chauffage!E14","v":{"$error":"#VALUE!"}},{"$f":"Chauffage!F14","v":{"$error":"#VALUE!"}},{"$f":"Chauffage!G14","v":{"$error":"#VALUE!"}},{"$f":"Chauffage!H14","v":{"$error":"#VALUE!"}},{"$f":"Chauffage!I14","v":{"$error":"#VALUE!"}},{"$f":"Chauffage!J14","v":{"$error":"#VALUE!"}},{"$f":"Chauffage!K14","v":{"$error":"#VALUE!"}},{"$f":"Chauffage!L14","v":{"$error":"#VALUE!"}}]
[null,null,null,null,null,null,null,null,null,null,null,null,null,null,null,null,null,null,null,null,null,null,null,null,{"$f":"Chauffage!A15","v":"Octobre"},{"$f":"Chauffage!B15","v":{"$error":"#VALUE!"}},{"$f":"Chauffage!C15","v":0},{"$f":"Chauffage!D15","v":{"$error":"#VALUE!"}},{"$f":"Chauffage!E15","v":{"$error":"#VALUE!"}},{"$f":"Chauffage!F15","v":{"$error":"#VALUE!"}},{"$f":"Chauffage!G15","v":{"$error":"#VALUE!"}},{"$f":"Chauffage!H15","v":{"$error":"#VALUE!"}},{"$f":"Chauffage!I15","v":{"$error":"#VALUE!"}},{"$f":"Chauffage!J15","v":{"$error":"#VALUE!"}},{"$f":"Chauffage!K15","v":{"$error":"#VALUE!"}},{"$f":"Chauffage!L15","v":{"$error":"#VALUE!"}}]
[null,null,null,null,null,null,null,null,null,null,null,null,null,null,null,null,null,null,null,null,null,null,null,null,{"$f":"Chauffage!A16","v":"Novembre"},{"$f":"Chauffage!B16","v":{"$error":"#VALUE!"}},{"$f":"Chauffage!C16","v":0},{"$f":"Chauffage!D16","v":{"$error":"#VALUE!"}},{"$f":"Chauffage!E16","v":{"$error":"#VALUE!"}},{"$f":"Chauffage!F16","v":{"$error":"#VALUE!"}},{"$f":"Chauffage!G16","v":{"$error":"#VALUE!"}},{"$f":"Chauffage!H16","v":{"$error":"#VALUE!"}},{"$f":"Chauffage!I16","v":{"$error":"#VALUE!"}},{"$f":"Chauffage!J16","v":{"$error":"#VALUE!"}},{"$f":"Chauffage!K16","v":{"$error":"#VALUE!"}},{"$f":"Chauffage!L16","v":{"$error":"#VALUE!"}}]
[null,null,null,null,null,null,null,null,null,null,null,null,null,null,null,null,null,null,null,null,null,null,null,null,{"$f":"Chauffage!A17","v":"Décembre"},{"$f":"Chauffage!B17","v":{"$error":"#VALUE!"}},{"$f":"Chauffage!C17","v":0},{"$f":"Chauffage!D17","v":{"$error":"#VALUE!"}},{"$f":"Chauffage!E17","v":{"$error":"#VALUE!"}},{"$f":"Chauffage!F17","v":{"$error":"#VALUE!"}},{"$f":"Chauffage!G17","v":{"$error":"#VALUE!"}},{"$f":"Chauffage!H17","v":{"$error":"#VALUE!"}},{"$f":"Chauffage!I17","v":{"$error":"#VALUE!"}},{"$f":"Chauffage!J17","v":{"$error":"#VALUE!"}},{"$f":"Chauffage!K17","v":{"$error":"#VALUE!"}},{"$f":"Chauffage!L17","v":{"$error":"#VALUE!"}}]
[null,null,null,null,null,null,null,null,null,null,null,null,null,null,null,null,null,null,null,null,null,null,null,null,{"$f":"Chauffage!A18","v":"Besoin annuel en chauffage annuel (kWh/an)"},{"$f":"Chauffage!B18","v":{"$error":"#VALUE!"}},{"$f":"Chauffage!C18","v":0},{"$f":"Chauffage!D18","v":0},{"$f":"Chauffage!E18","v":0},{"$f":"Chauffage!F18","v":0},{"$f":"Chauffage!G18","v":0},{"$f":"Chauffage!H18","v":0},{"$f":"Chauffage!I18","v":0},{"$f":"Chauffage!J18","v":0},{"$f":"Chauffage!K18","v":{"$error":"#VALUE!"}},{"$f":"Chauffage!L18","v":0}]
[null,null,null,null,null,null,null,null,null,null,null,null,null,null,null,null,null,null,null,null,null,null,null,null,{"$f":"Chauffage!A19","v":"Besoin annuel en chauffage (kWh/m²/an)"},{"$f":"Chauffage!B19","v":0},{"$f":"Chauffage!C19","v":0},{"$f":"Chauffage!D19","v":0},{"$f":"Chauffage!E19","v":0},{"$f":"Chauffage!F19","v":0},{"$f":"Chauffage!G19","v":0},{"$f":"Chauffage!H19","v":0},{"$f":"Chauffage!I19","v":0},{"$f":"Chauffage!J19","v":0},{"$f":"Chauffage!K19","v":{"$error":"#VALUE!"}},{"$f":"Chauffage!L19","v":0}]
[null,null,null,null,null,null,null,null,null,null,null,null,null,null,null,null,null,null,null,null,"Répartition des déperditions"]
["Répartition des déperditions",null,null,null,null,null,null,null,null,null,null,null,null,null,null,null,null,null,null,null,"Murs (ext et LNC)",{"$f":"'surface auto'!AH8","v":{"$error":"#VALUE!"}}]
["Murs (ext et LNC)",{"$f":"IFERROR(C18*100/$C$25,0)","v":0},{"$f":"Ubat!J5","v":0}]
["Vitrages",0,{"$f":"Ubat!I8","v":0},null,null,null,null,null,null,null,null,null,null,null,null,null,null,null,null,null,"Vitrages",{"$f":"'surface auto'!AJ15","v":{"$error":"#N/A"}}]
["Portes",0,{"$f":"Ubat!I6","v":0},null,null,null,null,null,null,null,null,null,null,null,null,null,null,null,null,null,"Portes",{"$f":"+'surface auto'!AH20","v":4.7250000000000005}]
["Plafond",0,{"$f":"Ubat!I3","v":0},null,null,null,null,null,null,null,null,null,null,null,null,null,null,null,null,null,"Plafond",{"$f":"'surface auto'!AM5","v":{"$error":"#N/A"}}]
["Plancher",0,{"$f":"Ubat!I5","v":0},null,null,null,null,null,null,null,null,null,null,null,null,null,null,null,null,null,"Plancher",{"$f":"'surface auto'!AM16","v":{"$error":"#N/A"}}]
["Ponts thermiques",0,{"$f":"Ubat!I9","v":0},null,null,null,null,null,null,null,null,null,null,null,null,null,null,null,null,null,"Ponts thermiques"]
["Ventilation",0,{"$f":"IFERROR(Calcul!V14,0)","v":0},null,null,null,null,null,null,null,null,null,null,null,null,null,null,null,null,null,"Ventilation"]
["Total",null,{"$f":"SUM(C18:C24)","v":0},null,null,null,null,null,null,null,null,null,null,null,null,null,null,null,null,null,"Total"]
[]
["Répartition de la facture énergétique",null,null,null,null,null,null,null,null,null,null,null,null,null,null,null,null,null,null,null,"Répartition de la facture énergétique"]
["Chauffage",{"$f":"IFERROR(C28*100/$C$32,0)","v":0},{"$f":"IFERROR(Calcul!P24,0)","v":0},{"$f":"IFERROR(Calcul!N24+Calcul!N25,0)","v":0},null,null,null,null,null,null,null,null,null,null,null,null,null,null,null,null,"Chauffage"]
["ECS",{"$f":"IFERROR(C29*100/$C$32,0)","v":0},{"$f":"Calcul!P27","v":{"$error":"#N/A"}},{"$f":"Calcul!N27","v":{"$error":"#N/A"}},null,null,null,null,null,null,null,null,null,null,null,null,null,null,null,null,"ECS"]
["Eclairage",{"$f":"IFERROR(C30*100/$C$32,0)","v":0},{"$f":"IFERROR(Calcul!P31,0)","v":0},{"$f":"IFERROR(Calcul!N31,0)","v":0}]
["Auxiliaires chauffage/ventilation",{"$f":"IFERROR(C31*100/$C$32,0)","v":0},{"$f":"IFERROR(Calcul!P29+Calcul!P30,0)","v":0},{"$f":"IFERROR(Calcul!N29+Calcul!N30,0)","v":0},null,null,null,null,null,null,null,null,null,null,null,null,null,null,null,null,"Eclairage"]
["Total",null,{"$f":"SUM(C28:C31)","v":{"$error":"#N/A"}},null,null,null,null,null,null,null,null,null,null,null,null,null,null,null,null,null,"Auxiliaires"]
[null,null,null,null,null,null,null,null,null,null,null,null,null,null,null,null,null,null,null,null,"Total"]

{"sheet":"synthèse","index":2,"n_rows":131,"n_cols":12,"rows_kept":131,"cut":false,"hidden":true,"merged":[[9,8,9,11],[2,1,2,12],[21,6,21,7],[22,6,22,7],[21,8,21,10],[22,8,22,10],[6,8,6,12],[16,8,16,10],[9,6,9,7],[10,8,10,10],[11,8,11,10],[12,8,12,10],[13,8,13,10],[14,8,14,10],[15,8,15,10],[4,1,4,2],[4,3,4,5],[15,1,15,2],[15,3,15,5],[16,3,16,5],[17,3,17,5],[16,1,16,2],[10,1,10,2],[11,1,11,2],[23,6,23,7],[17,6,17,7],[18,6,18,7],[17,8,17,10],[19,6,19,7],[19,8,19,10],[20,6,20,7],[18,8,18,10],[20,8,20,10],[25,8,25,10],[21,1,21,2],[24,1,24,2],[24,3,24,5],[25,3,25,5],[24,6,24,7],[24,8,24,10],[84,1,84,12],[64,1,64,12],[47,1,47,12],[65,1,65,4],[46,1,46,4],[46,11,46,13],[28,7,28,9],[32,7,32,9],[36,7,36,10],[44,8,44,10],[38,11,38,13],[42,11,42,13],[38,1,38,4],[49,1,49,4],[50,1,50,4],[51,1,51,4],[52,1,52,4],[89,11,90,11],[54,1,54,4],[55,1,55,11],[56,1,56,11],[57,1,57,11],[59,1,59,4],[61,1,61,11],[62,1,62,11],[86,1,86,10],[87,2,87,5],[87,9,87,11],[88,2,88,3],[89,2,89,3],[89,10,90,10],[90,2,90,3],[83,1,83,4],[87,6,87,7],[5,3,5,5],[6,1,6,2],[6,3,6,5],[5,1,5,2],[7,1,7,2],[7,3,7,5],[8,1,8,2],[8,3,8,5],[9,1,9,2],[9,3,9,5],[4,6,4,7],[5,6,5,7],[6,6,6,7],[7,6,7,7],[8,6,8,7],[10,6,10,7],[11,6,11,7],[12,6,12,7],[26,3,26,10],[23,8,23,10],[14,6,14,7],[15,6,15,7],[13,6,13,7],[16,6,16,7],[4,8,4,10],[5,8,5,10],[7,8,7,10],[8,8,8,10],[10,3,10,5],[18,3,18,5],[22,3,22,5],[23,3,23,5],[19,3,19,5],[20,3,20,5],[53,1,53,4],[26,1,26,2],[14,1,14,2],[14,3,14,5],[11,3,11,5],[12,1,12,2],[12,3,12,5],[13,1,13,2],[13,3,13,5],[28,1,28,5],[17,1,17,2],[18,1,18,2],[22,1,22,2],[23,1,23,2],[19,1,19,2],[20,1,20,2],[130,1,130,12],[123,1,123,11],[124,1,124,11],[125,1,125,11],[128,1,128,11],[3,1,3,4],[102,1,102,11],[103,1,103,11],[104,1,104,11],[92,2,92,3],[117,1,117,11],[105,1,105,11],[106,1,106,10],[107,1,107,11],[108,1,108,11],[109,1,109,11],[111,1,111,4],[112,1,112,4],[113,1,113,4],[114,1,114,4],[115,1,115,4],[116,1,116,4],[60,1,60,11],[48,1,48,4],[94,2,94,3],[95,2,95,3],[96,2,96,3],[99,1,99,2],[119,1,119,4],[120,1,120,11],[121,1,121,11],[122,1,122,11],[118,1,118,12],[101,1,101,12],[98,2,98,3]]}
[]
[]
[null,"Syntèse des Saisies de l'étude"]
[]
[null,"Nom de l'étude :",null,{"$f":"Saisies!$G$2","v":0},null,null,"Type de chauffage :",null,{"$f":"'surface auto'!C8","v":"Chauffage individuel"}]
[null,"Typologie :",null,{"$f":"Saisies!E6","v":0},null,null,"Production :",null,{"$f":"'surface auto'!C13 & \"  ( \" & 'surface auto'!C17 & \" )\"","v":{"$error":"#VALUE!"}}]
[null,"Nombre d'étages :",null,{"$f":"Saisies!E7","v":0},null,null,"Régulation :",null,{"$f":"'surface auto'!C15","v":"Régulation + plancher chauffant, ou Emetteur ne permettant pas un arrêt total de l'émission"}]
[null,"Surface habitable :",null,{"$f":"Saisies!E11","v":0},null,null,"Type d'émission:",null,{"$f":"'surface auto'!C9","v":{"$error":"#VALUE!"}}]
[null,"Shon RT :",null,{"$f":"Saisies!E13","v":0},null,null,"Rendement global : ",null,{"$f":"'surface auto'!C18","v":{"$error":"#VALUE!"}}]
[null,"Type de logement :",null,{"$f":"Saisies!E12","v":0},null,null,"Type d'appoint :",null,{"$f":"IF('surface auto'!F13=\"sans appoint\",\"sans appoint\",'surface auto'!F17 & \"   ( \" & 'surface auto'!F13 & \" )\")","v":{"$error":"#VALUE!"}}]
[null,"Ville :",null,{"$f":"'Liste communes'!S116 & \"   zone  \"& Saisies!G15","v":{"$error":"#VALUE!"}},null,null,"Emission d'appoint :",null,{"$f":"IF('surface auto'!F13=\"sans appoint\",\"-\",'surface auto'!F9)","v":{"$error":"#VALUE!"}}]
[null,"Mitoyenneté :",null,{"$f":"INDEX('surface auto'!AV9:AV14,'surface auto'!AU10,1)","v":"1 petit et 1 grand"},null,null,"Rendement global : ",null,{"$f":"IF('surface auto'!F13=\"sans appoint\",\"-\",'surface auto'!F18)","v":{"$error":"#VALUE!"}}]
[null,"Hauteur sous plafond :",null,{"$f":"Saisies!E17","v":0},null,null,"Couverture appoint :",null,{"$f":"IF('surface auto'!F13=\"sans appoint\",\"-\",Calcul!N69 & \"%\")","v":{"$error":"#VALUE!"}}]
[null,"Forme du bâtiment :",null,{"$f":"INDEX('surface auto'!AO11:AO14,Saisies!M165,1)","v":"autres.."},null,null,"Production ECS :",null,{"$f":"'surface auto'!I8","v":{"$error":"#VALUE!"}}]
[null,"Nombre d'occupants :",null,{"$f":"Saisies!$E$21","v":0},null,null,"Rendement global : ",null,{"$f":"'surface auto'!I11","v":{"$error":"#VALUE!"}}]
[null,{"$f":"IF(D27=\"intermédiaire\",\"-\",\"Type d'isolation\")","v":"-"},null,{"$f":"IF(D27=\"intermédiaire\",\"-\",Saisies!$E$22)","v":"-"},null,null,"T° Consigne :",null,{"$f":"Calcul!N63","v":55}]
[null,{"$f":"IF(D27=\"intermédiaire\",\"-\",\"Type de plancher\")","v":"-"},null,{"$f":"IF(D27=\"intermédiaire\",\"-\",Saisies!$E$23)","v":"-"},null,null,"Volume du ballon :",null,{"$f":"Calcul!N62 & \" L\"","v":"0 L"}]
[null,{"$f":"IF(D27=\"intermédiaire\",\"-\",\"Type de plafond\")","v":"-"},null,{"$f":"IF(D27=\"intermédiaire\",\"-\",Saisies!$G$33)","v":"-"},null,null,"Ballon en vol chauffé :",null,{"$f":"Calcul!L60","v":"NON"}]
[null,"Consigne chauffage :",null,{"$f":"Calcul!N65 & \"°C\"","v":"20°C"},null,null,"Nb jours d'occupation :",null,{"$f":"Calcul!N64 & \" jours\"","v":"330 jours"}]
[null,"Consigne réduit :",null,{"$f":"Calcul!L65-Calcul!N67 & \"°C\"","v":"-2°C"},null,null,"Besoins en ECS :",null,{"$f":"Calcul!N61 & \" L/jour/personnes\"","v":"35 L/jour/personnes"}]
[null,"Nb d'heures de réduit :",null,{"$f":"Calcul!N66 & \" h\"","v":"6 h"},null,null,"Surface solaire themique :",null,{"$f":"IF(Calcul!C33<>FALSE,Calcul!N56,\"-\") & \"   (utilisation en \" & Calcul!C33 & \" )\"","v":"-   (utilisation en FAUX )"}]
[null,"T°C extérieure de base :",null,{"$f":"Calcul!C13","v":{"$error":"#VALUE!"}},null,null,"Type de capteur :",null,{"$f":"Calcul!L57","v":0}]
[null,"Puissance éclairage :",null,{"$f":"Calcul!N70 & \"  w/m² \"","v":"4  w/m² "},null,null,"Orientation :",null,{"$f":"Calcul!N58","v":"Sud"}]
[null,"Etanchéité à l'air Q4 :",null,{"$f":"Saisies!H92","v":3},null,null,"Inclinaison :",null,{"$f":"Calcul!N59","v":45}]
[null,"Type de ventilation :",null,{"$f":"Calcul!C11","v":{"$error":"#VALUE!"}},null,null,"Taux de couverture :",null,{"$f":"Calcul!C39","v":0}]
[]
[null,"Type de calcul :",null,{"$f":"IF(Chauffage!H20=0,\"intermédiaire\",\"simplifié\")","v":"intermédiaire"}]
[]
[null,"Menuiseries",null,null,null,null,null,"Toiture"]
[null,null,"Surface (m²)","U","Déperditions (W/°C)","masque",null,"Surface (m²)","U","Déperditions (W/°C)"]
[null,"Nord",{"$f":"IFERROR(IF($D$27=\"intermédiaire\",'surface auto'!Y12,\"auto\"),0)","v":0},{"$f":"IFERROR(IF($D$27=\"intermédiaire\",'surface auto'!Z12,\"auto\"),0)","v":0},{"$f":"IFERROR(IF($D$27=\"intermédiaire\",'surface auto'!AA12,\"auto\"),0)","v":0},{"$f":"IFERROR(IF($D$27=\"intermédiaire\",Calcul!N6,\"auto\"),0)","v":0},null,{"$f":"IFERROR(IF($D$27=\"intermédiaire\",'surface auto'!AC9,\"auto\"),0)","v":0},{"$f":"IFERROR(IF($D$27=\"intermédiaire\",'surface auto'!Z25,\"auto\"),0)","v":0},{"$f":"IFERROR(IF($D$27=\"intermédiaire\",'surface auto'!AD9,\"auto\"),0)","v":0}]
[null,"Sud",{"$f":"IFERROR(IF($D$27=\"intermédiaire\",'surface auto'!Y13,\"auto\"),0)","v":0},{"$f":"IFERROR(IF($D$27=\"intermédiaire\",'surface auto'!Z13,\"auto\"),0)","v":0},{"$f":"IFERROR(IF($D$27=\"intermédiaire\",'surface auto'!AA13,\"auto\"),0)","v":0},{"$f":"IFERROR(IF($D$27=\"intermédiaire\",Calcul!I6,\"auto\"),0)","v":0}]
[null,"Est",{"$f":"IFERROR(IF($D$27=\"intermédiaire\",'surface auto'!Y14,\"auto\"),0)","v":0},{"$f":"IFERROR(IF($D$27=\"intermédiaire\",'surface auto'!Z14,\"auto\"),0)","v":0},{"$f":"IFERROR(IF($D$27=\"intermédiaire\",'surface auto'!AA14,\"auto\"),0)","v":0},{"$f":"IFERROR(IF($D$27=\"intermédiaire\",Calcul!K6,\"auto\"),0)","v":0},null,"Planchers"]
[null,"Ouest",{"$f":"IFERROR(IF($D$27=\"intermédiaire\",'surface auto'!Y15,\"auto\"),0)","v":0},{"$f":"IFERROR(IF($D$27=\"intermédiaire\",'surface auto'!Z15,\"auto\"),0)","v":0},{"$f":"IFERROR(IF($D$27=\"intermédiaire\",'surface auto'!AA15,\"auto\"),0)","v":0},{"$f":"IFERROR(IF($D$27=\"intermédiaire\",Calcul!L6,\"auto\"),0)","v":0},null,"Surface (m²)","U","Déperditions (W/°C)"]
[null,"Horizontal",{"$f":"IFERROR(IF($D$27=\"intermédiaire\",'surface auto'!Y16,\"auto\"),0)","v":0},{"$f":"IFERROR(IF($D$27=\"intermédiaire\",'surface auto'!Z16,\"auto\"),0)","v":" "},{"$f":"IFERROR(IF($D$27=\"intermédiaire\",'surface auto'!AA16,\"auto\"),0)","v":0},{"$f":"IFERROR(IF($D$27=\"intermédiaire\",Calcul!Q6,\"auto\"),0)","v":0},null,{"$f":"IFERROR(IF($D$27=\"intermédiaire\",'surface auto'!AC13,\"auto\"),0)","v":0},{"$f":"IFERROR(IF($D$27=\"intermédiaire\",'surface auto'!AB25,\"auto\"),0)","v":0},{"$f":"IFERROR(IF($D$27=\"intermédiaire\",'surface auto'!AD13,\"auto\"),0)","v":0}]
[null,"Portes",{"$f":"IFERROR(IF($D$27=\"intermédiaire\",'surface auto'!AC17,\"auto\"),0)","v":0},{"$f":"IFERROR(IF($D$27=\"intermédiaire\",'surface auto'!AC25,\"auto\"),0)","v":0},{"$f":"IFERROR(IF($D$27=\"intermédiaire\",'surface auto'!AD17,\"auto\"),0)","v":0},"-"]
[null,"TOTAL",{"$f":"IFERROR(IF($D$27=\"intermédiaire\",'surface auto'!Y17+'surface auto'!AC17,'surface auto'!AH15+'surface auto'!AH20),0)","v":0},null,{"$f":"IFERROR(IF($D$27=\"intermédiaire\",'surface auto'!AA17+'surface auto'!AD17,'surface auto'!AJ15+'surface auto'!AH20),0)","v":0},null,null,"Ponts thermiques"]
[null,null,null,null,null,null,null,"type","Psi","longueur","Déperditions (W/°C)"]
[null,"Murs",null,null,null,null,null,"L8",{"$f":"IFERROR(IF($D$27=\"intermédiaire\",'Pont thermique'!J7,\"auto\"),0)","v":0},{"$f":"IFERROR(IF($D$27=\"intermédiaire\",'Pont thermique'!K7,\"auto\"),0)","v":0},{"$f":"IFERROR(IF($D$27=\"intermédiaire\",'Pont thermique'!L7,\"auto\"),0)","v":0}]
[null,null,"Surface (m²)","U","Déperditions (W/°C)",null,null,"L9",{"$f":"IFERROR(IF($D$27=\"intermédiaire\",'Pont thermique'!J8,\"auto\"),0)","v":0},{"$f":"IFERROR(IF($D$27=\"intermédiaire\",'Pont thermique'!K8,\"auto\"),0)","v":0},{"$f":"IFERROR(IF($D$27=\"intermédiaire\",'Pont thermique'!L8,\"auto\"),0)","v":0}]
[null,"Nord",{"$f":"IFERROR(IF($D$27=\"intermédiaire\",'surface auto'!Y5,\"auto\"),0)","v":0},{"$f":"IFERROR(IF($D$27=\"intermédiaire\",'surface auto'!Z5,\"auto\"),0)","v":0},{"$f":"IFERROR(IF($D$27=\"intermédiaire\",'surface auto'!AA5,\"auto\"),0)","v":0},null,null,"L10",{"$f":"IFERROR(IF($D$27=\"intermédiaire\",'Pont thermique'!J9,\"auto\"),0)","v":0},{"$f":"IFERROR(IF($D$27=\"intermédiaire\",'Pont thermique'!K9,\"auto\"),0)","v":0},{"$f":"IFERROR(IF($D$27=\"intermédiaire\",'Pont thermique'!L10+'Pont thermique'!L11+'Pont thermique'!L12+'Pont thermique'!L13+'Pont thermique'!L14,\"auto\"),0)","v":0}]
[null,"Sud",{"$f":"IFERROR(IF($D$27=\"intermédiaire\",'surface auto'!Y6,\"auto\"),0)","v":0},{"$f":"IFERROR(IF($D$27=\"intermédiaire\",'surface auto'!Z6,\"auto\"),0)","v":0},{"$f":"IFERROR(IF($D$27=\"intermédiaire\",'surface auto'!AA6,\"auto\"),0)","v":0},null,null,"Autres",{"$f":"IFERROR(IF($D$27=\"intermédiaire\",('Pont thermique'!J10*'Pont thermique'!K10+'Pont thermique'!J11*'Pont thermique'!K11+'Pont thermique'!J12*'Pont thermique'!K12+'Pont thermique'!J13*'Pont thermique'!K13+'Pont thermique'!J14*'Pont thermique'!K14)/('Pont thermique'!K10+'Pont thermique'!K11+'Pont thermique'!K12+'Pont thermique'!K13+'Pont thermique'!K14),\"auto\"),0)","v":0},{"$f":"IFERROR(IF($D$27=\"intermédiaire\",'Pont thermique'!K10+'Pont thermique'!K11+'Pont thermique'!K12+'Pont thermique'!K13+'Pont thermique'!K14,\"auto\"),0)","v":0},{"$f":"IFERROR(IF($D$27=\"intermédiaire\",'Pont thermique'!L10,\"auto\"),0)","v":0}]
[null,"Est",{"$f":"IFERROR(IF($D$27=\"intermédiaire\",'surface auto'!Y7,\"auto\"),0)","v":0},{"$f":"IFERROR(IF($D$27=\"intermédiaire\",'surface auto'!Z7,\"auto\"),0)","v":0},{"$f":"IFERROR(IF($D$27=\"intermédiaire\",'surface auto'!AA7,\"auto\"),0)","v":0},null,null,"TOTAL",null,null,{"$f":"IFERROR(IF($D$27=\"intermédiaire\",'Pont thermique'!L15,'Pont thermique'!H29),0)","v":0}]
[null,"Ouest",{"$f":"IFERROR(IF($D$27=\"intermédiaire\",'surface auto'!Y8,\"auto\"),0)","v":0},{"$f":"IFERROR(IF($D$27=\"intermédiaire\",'surface auto'!Z8,\"auto\"),0)","v":0},{"$f":"IFERROR(IF($D$27=\"intermédiaire\",'surface auto'!AA8,\"auto\"),0)","v":0}]
[null,"Intérieurs",{"$f":"IFERROR(IF($D$27=\"intermédiaire\",'surface auto'!AC5,\"auto\"),0)","v":0},{"$f":"IFERROR(IF($D$27=\"intermédiaire\",'surface auto'!X25,\"auto\"),0)","v":0},{"$f":"IFERROR(IF($D$27=\"intermédiaire\",'surface auto'!AD5,\"auto\"),0)","v":0},null,null,"AT Bat",{"$f":"IF(D27=\"intermédiaire\",ROUND('surface auto'!Y19,2),ROUND('surface auto'!AG26,2)) & \"   hors plancher bas :   \" & IF(D27=\"intermédiaire\",ROUND('surface auto'!Y20,2),ROUND('surface auto'!AG27,2)) & \"  m²\"","v":"0   hors plancher bas :   0  m²"}]
[null,"TOTAL",{"$f":"IFERROR(IF($D$27=\"intermédiaire\",'surface auto'!Y9+'surface auto'!AC5,'surface auto'!AG8+'surface auto'!AF24),0)","v":0},null,{"$f":"IFERROR(IF($D$27=\"intermédiaire\",'surface auto'!AA9+'surface auto'!AD5,'surface auto'!AH8+'surface auto'!AI24),0)","v":0},null,null,"Puissance chauffage/ECS en KW",null,{"$f":"IF(Chauffage!A91=2,((Calcul!X13*(Calcul!L65-Calcul!C13))/1000)+ECS!C136,(Calcul!X13*(Calcul!L65-Calcul!C13))/1000)","v":{"$error":"#VALUE!"}},{"$f":"IF(Chauffage!B208>0,Chauffage!B208/1000+synthèse!J46)","v":false}]
[]
[null,"Répartition des déperditions"]
[]
[]
[]
[]
[]
[]
[]
[]
[]
[]
[]
[]
[]
[]
[]
[]
[null,"Synthèse du calcul du Ubat"]
[]
[]
[]
[]
[]
[]
[]
[]
[]
[]
[]
[]
[]
[]
[]
[]
[]
[]
[]
[null,"Syntèse des résultats de l'étude"]
[]
[]
[null,null,{"$f":"+Calcul!H22","v":"Besoins chauffage (énergie finale)"},null,null,null,"Puissance chauffage (kW)",null,{"$f":"((Calcul!V13+Calcul!V14)*'Liste communes'!J54)/1000","v":{"$error":"#VALUE!"}},"Besoins chauffage (énergie primaire)"]
[null,null,{"$f":"Calcul!H23","v":"Besoin net chauffage"},null,{"$f":"Calcul!J23","v":0},{"$f":"Calcul!K23","v":"kwh/an"},null,null,null,{"$f":"Calcul!O23","v":"Kwh EP"},{"$f":"Calcul!P23","v":"Kwh Ep/m².an"},"CO2 (kgC02/m²,an)"]
[null,null,{"$f":"Calcul!H24","v":"Conso combustible principal"},null,{"$f":"Calcul!J24","v":{"$error":"#VALUE!"}},{"$f":"Calcul!K24","v":"kwh/an"},{"$f":"Calcul!L24","v":{"$error":"#VALUE!"}},{"$f":"Calcul!M24","v":{"$error":"#VALUE!"}},{"$f":"Calcul!N24","v":{"$error":"#VALUE!"}},{"$f":"Calcul!O24","v":{"$error":"#VALUE!"}},{"$f":"Calcul!P24","v":0},{"$f":"Calcul!Q24","v":{"$error":"#VALUE!"}}]
[null,null,{"$f":"Calcul!H25","v":"Conso combustible appoint"},null,{"$f":"Calcul!J25","v":{"$error":"#VALUE!"}},{"$f":"Calcul!K25","v":"kwh/an"},{"$f":"Calcul!L25","v":{"$error":"#VALUE!"}},{"$f":"Calcul!M25","v":{"$error":"#VALUE!"}},{"$f":"Calcul!N25","v":{"$error":"#VALUE!"}},{"$f":"Calcul!O25","v":{"$error":"#VALUE!"}}]
[]
[null,null,{"$f":"Calcul!H27","v":"Besoins ECS"},null,{"$f":"Calcul!J27","v":{"$error":"#N/A"}},{"$f":"Calcul!K27","v":"kwh/an"},{"$f":"Calcul!L27","v":{"$error":"#N/A"}},{"$f":"Calcul!M27","v":{"$error":"#VALUE!"}},{"$f":"Calcul!N27","v":{"$error":"#N/A"}},{"$f":"Calcul!O27","v":{"$error":"#N/A"}},{"$f":"Calcul!P27","v":{"$error":"#N/A"}},{"$f":"Calcul!Q27","v":{"$error":"#VALUE!"}}]
[]
[null,null,{"$f":"Calcul!H29","v":"Consommation auxiliaires"},null,{"$f":"Calcul!J29","v":{"$error":"#VALUE!"}},{"$f":"Calcul!K29","v":"kwh/an"},null,null,{"$f":"Calcul!N29","v":{"$error":"#VALUE!"}},{"$f":"Calcul!O29","v":{"$error":"#VALUE!"}},{"$f":"Calcul!P29","v":{"$error":"#VALUE!"}},{"$f":"Calcul!Q29","v":{"$error":"#VALUE!"}}]
[null,null,{"$f":"Calcul!H30","v":"Consommation aux de  ventilation"},null,{"$f":"Calcul!J30","v":0},{"$f":"Calcul!K30","v":"kwh/an"},null,null,{"$f":"Calcul!N30","v":0},{"$f":"Calcul!O30","v":0},{"$f":"Calcul!P30","v":{"$error":"#DIV/0!"}},{"$f":"Calcul!Q30","v":{"$error":"#DIV/0!"}}]
[null,null,{"$f":"Calcul!H31","v":"Consommation Eclairage"},null,{"$f":"Calcul!J31","v":0},{"$f":"Calcul!K31","v":"kwh/an"},null,null,{"$f":"Calcul!N31","v":0},{"$f":"Calcul!O31","v":0},{"$f":"Calcul!P31","v":{"$error":"#DIV/0!"}},{"$f":"Calcul!Q31","v":{"$error":"#DIV/0!"}}]
[]
[null,null,"TOTAL",null,{"$f":"E90+E91+E93+E95+E96+E97","v":{"$error":"#VALUE!"}},"kwh/an",null,null,{"$f":"Calcul!N33","v":{"$error":"#VALUE!"}},{"$f":"Calcul!O33","v":{"$error":"#VALUE!"}},{"$f":"Calcul!P33","v":{"$error":"#N/A"}},{"$f":"Calcul!Q33","v":{"$error":"#VALUE!"}}]
[]
[]
[null,"Répartition des consommations"]
[]
[]
[]
[]
[]
[]
[]
[]
[]
[]
[]
[]
[]
[]
[]
[]
[null,"Détail des apports, déperditions et températures mensuels"]
[]
[]
[]
[]
[]
[]
[]
[]
[]
[]
[]
[null,"Etiquette énergétique"]

{"sheet":"SOLAIRE","index":3,"n_rows":56,"n_cols":17,"rows_kept":56,"cut":false,"hidden":true,"merged":[[2,6,2,7],[6,5,8,5],[6,0,8,0],[6,1,8,1],[6,2,8,2],[6,3,8,3],[6,4,8,4],[6,6,8,6],[6,7,8,7],[0,3,0,4],[1,6,1,7],[1,8,1,9],[4,12,4,14],[5,0,5,14],[3,0,3,1],[4,3,4,4],[3,6,3,7],[4,0,4,1],[0,6,0,7],[0,8,0,9],[4,6,4,7],[0,1,0,2],[0,12,0,13],[1,1,1,2],[2,0,2,1],[25,0,25,3],[25,9,29,14],[26,0,26,3],[27,0,27,3],[28,0,28,3],[6,12,8,12],[6,13,8,13],[6,14,8,14],[23,8,24,8],[23,11,24,11],[6,11,8,11],[6,8,8,8],[6,9,8,9],[6,10,8,10],[35,0,35,14],[36,0,36,14],[37,0,37,14],[29,0,29,3],[29,6,29,8],[30,0,31,14],[32,0,32,14],[33,0,33,14],[34,0,34,14]]}
["Région de :","Besançon",null,"Situation du logement :",null,"Rural","Rendement optique du capteur :",null,{"$f":"IF(F5=\"\",0,IF(F5=\"Capteur plan\",0.7,0.8))","v":0.7},null,"Capteur plan",null,null,null,null,"Agen"]
["Latitude :",{"$f":"47.3","v":47.3},null,"Nombre de personnes :",{"$f":"Saisies!E21","v":0},null,"K1, K2 (Déperditions thermiques) :",null,{"$f":"IF(F5=\"\",0,IF(F5=\"Capteur plan\",3.6+0.2,1.66+0.35))","v":3.8000000000000003},null,"Capteur à tubes",null,null,null,null,"Ajaccio"]
["Angle d'inclinaison capteur :",null,{"$f":"Calcul!N59","v":45},"Surface capteur (m²) :",{"$f":"Calcul!N56","v":0},null,"Besoin annuel en KW/an :",null,{"$f":"Calcul!C37","v":{"$error":"#VALUE!"}},null,1,null,null,null,null,"Ambérieu"]
["Azimut par rap. au sud (+/-) :",null,{"$f":"VLOOKUP(Calcul!N58,'Apports solaires'!L30:M34,2,FALSE)","v":1},"DJU par an :",{"$f":"INDEX('Liste communes'!R21:R28,'Liste communes'!A18,1)","v":{"$error":"#VALUE!"}},null,"Besoin ECS en KW/an :",null,{"$f":"Calcul!C36","v":{"$error":"#N/A"}},null,null,null,null,null,null,"Angers"]
["Altitude du logement :",null,{"$f":"INDEX('Liste communes'!E21:E28,'Liste communes'!A18,1)","v":{"$error":"#VALUE!"}},"Type de capteur :",null,{"$f":"INDEX(SOLAIRE!K1:L2,SOLAIRE!K3,1)","v":"Capteur plan"},"Besoin ECS en KW/mois :",null,{"$f":"(Calcul!C36/12)","v":{"$error":"#N/A"}},null,null,null,null,null,null,"Angoulème"]
[null,null,null,null,null,null,null,null,null,null,null,null,null,null,null,"Annecy"]
["Mois","Rayonnement global","T°C extérieure","Rendement capteur","Coefficient Site","Coefficient latitude","Q (énergie)","Nb. Capteurs ECS seule","Rend. capteurs en ECS","Sur-production ou déficit en ECS","Nb. Capteurs ECS + Chauffage","Rend. capteurs ECS + chauffage","Sur-production ou déficit en ECS + chauffage","Degrés jours unifiés","ECS + Chauffage","Bastia"]
[null,null,null,null,null,null,null,null,null,null,null,null,null,null,null,"Besançon"]
[null,null,null,null,null,null,null,null,null,null,null,null,null,null,null,"Biarritz"]
["-","KWh/m²/mois","°C","%","%","%","KWh/m²/mois",{"$f":"E3/2","v":0},"%","KWh/mois",{"$f":"IF(OR(Calcul!C33=\"Chauffage + ECS\",Calcul!C33=\"Chauffage\"),Calcul!N56,0)","v":0},"%","KWh/mois","°C","KWh/mois","Bordeaux"]
["janvier",{"$f":"INDEX('Liste communes'!BI20:BI29,'Liste communes'!A18,1)*31","v":{"$error":"#VALUE!"}},{"$f":"INDEX('Liste communes'!AG20:AG29,'Liste communes'!A18,1)","v":{"$error":"#VALUE!"}},{"$f":"IF(C11=0,0,ROUND($I$1-$I$2*(90-(POWER(C11,0.86)))/800,2))","v":{"$error":"#VALUE!"}},{"$f":"IF(B1<>\"\",ROUND(IF(OR($B$1=\"Ajaccio\",$B$1=\"Bastia\",$B$1=\"Gourdon\",$B$1=\"Marseille\",$B$1=\"Nice\",$B$1=\"St Auban\",$B$1=\"Toulon\"),IF(AND($F$1=\"Rural\",$C$5<=300),1.1,IF(AND($F$1=\"Rural\",$C$5>300,$C$5<=1100),(($C$5-300)*0.00004)+1.19,IF(AND($F$1=\"Rural\",$C$5>1100),(($C$5-300)*0.00004)+1.28,0.93))),IF(AND($F$1=\"Rural\",$C$5<=300),1.07,IF(AND($F$1=\"Rural\",$C$5>300,$C$5<=1100),(($C$5-300)*0.00004)+1.16,IF(AND($F$1=\"Rural\",$C$5>1100),(($C$5-300)*0.00004)+1.25,0.9)))),2),0)","v":{"$error":"#VALUE!"}},{"$f":"IF(C3<>\"\",IF(C3=30,0.93,IF(C3=35,0.94,IF(C3=40,0.95,IF(C3=45,1,IF(C3=50,1.02,IF(C3=55,1.03,1.04)))))),0)","v":1},{"$f":"ROUND(B11*D11*E11*F11*$C$4,2)","v":{"$error":"#VALUE!"}},{"$f":"IF(G11*$H$10*$E$3>$I$5,$I$5,G11*$H$10*$E$3)","v":{"$error":"#VALUE!"}},{"$f":"IF($I$5<>0,H11/$I$5,0)","v":{"$error":"#N/A"}},{"$f":"(G11*$H$10*$E$3)-Q11","v":{"$error":"#VALUE!"}},{"$f":"IF(G11*$K$10*$E$3>O11,O11,G11*$K$10*$E$3)","v":{"$error":"#VALUE!"}},{"$f":"IF(K11<>0,K11/O11,0)","v":{"$error":"#VALUE!"}},{"$f":"(G11*$K$10*$E$3)-O11","v":{"$error":"#VALUE!"}},{"$f":"INDEX('Liste communes'!F21:F28,'Liste communes'!A18,1)","v":{"$error":"#VALUE!"}},{"$f":"IF($E$4<>0,(($I$3/$E$4)*N11)+$I$5,0)","v":{"$error":"#VALUE!"}},"Bourges",{"$f":"$I$5*1.2","v":{"$error":"#N/A"}}]
["février",{"$f":"INDEX('Liste communes'!BJ20:BJ29,'Liste communes'!A18,1)*31","v":{"$error":"#VALUE!"}},{"$f":"INDEX('Liste communes'!AH20:AH29,'Liste communes'!A18,1)","v":{"$error":"#VALUE!"}},{"$f":"IF(C12=0,0,ROUND($I$1-$I$2*(90-(POWER(C12,0.88)))/800,2))","v":{"$error":"#VALUE!"}},{"$f":"IF(B1<>\"\",ROUND(IF(OR($B$1=\"Ajaccio\",$B$1=\"Bastia\",$B$1=\"Gourdon\",$B$1=\"Marseille\",$B$1=\"Nice\",$B$1=\"St Auban\",$B$1=\"Toulon\"),IF(AND($F$1=\"Rural\",$C$5<=300),1.1,IF(AND($F$1=\"Rural\",$C$5>300,$C$5<=1100),(($C$5-300)*0.00004)+1.19,IF(AND($F$1=\"Rural\",$C$5>1100),(($C$5-300)*0.00004)+1.28,0.93))),IF(AND($F$1=\"Rural\",$C$5<=300),1.07,IF(AND($F$1=\"Rural\",$C$5>300,$C$5<=1100),(($C$5-300)*0.00004)+1.16,IF(AND($F$1=\"Rural\",$C$5>1100),(($C$5-300)*0.00004)+1.25,0.9)))),2),0)","v":{"$error":"#VALUE!"}},{"$f":"IF(C3<>\"\",IF(C3=30,0.94,IF(C3=35,0.95,IF(C3=40,0.96,IF(C3=45,1,IF(C3=50,1.02,IF(C3=55,1.02,1.03)))))),0)","v":1},{"$error":"#VALUE!"},{"$error":"#VALUE!"},{"$error":"#N/A"},{"$f":"(G12*$H$10*$E$3)-Q12","v":{"$error":"#VALUE!"}},{"$f":"IF(G12*$K$10*$E$3>O12,O12,G12*$K$10*$E$3)","v":{"$error":"#VALUE!"}},{"$f":"IF(K12<>0,K12/O12,0)","v":{"$error":"#VALUE!"}},{"$error":"#VALUE!"},{"$f":"INDEX('Liste communes'!G21:G28,'Liste communes'!A18,1)","v":{"$error":"#VALUE!"}},{"$error":"#VALUE!"},"Brest",{"$f":"$I$5*1.2","v":{"$error":"#N/A"}}]
["mars",{"$f":"INDEX('Liste communes'!BK20:BK29,'Liste communes'!A18,1)*31","v":{"$error":"#VALUE!"}},{"$f":"INDEX('Liste communes'!AI20:AI29,'Liste communes'!A18,1)","v":{"$error":"#VALUE!"}},{"$f":"IF(C13=0,0,ROUND($I$1-$I$2*(85-(POWER(C13,0.88)))/800,2))","v":{"$error":"#VALUE!"}},{"$f":"IF(B1<>\"\",ROUND(IF(OR($B$1=\"Ajaccio\",$B$1=\"Bastia\",$B$1=\"Gourdon\",$B$1=\"Marseille\",$B$1=\"Nice\",$B$1=\"St Auban\",$B$1=\"Toulon\"),IF(AND($F$1=\"Rural\",$C$5<=300),1.1,IF(AND($F$1=\"Rural\",$C$5>300,$C$5<=1100),(($C$5-300)*0.00004)+1.19,IF(AND($F$1=\"Rural\",$C$5>1100),(($C$5-300)*0.00004)+1.28,0.93))),IF(AND($F$1=\"Rural\",$C$5<=300),1.07,IF(AND($F$1=\"Rural\",$C$5>300,$C$5<=1100),(($C$5-300)*0.00004)+1.16,IF(AND($F$1=\"Rural\",$C$5>1100),(($C$5-300)*0.00004)+1.25,0.9)))),2),0)","v":{"$error":"#VALUE!"}},{"$f":"IF(C3<>\"\",IF(C3=30,0.95,IF(C3=35,0.96,IF(C3=40,0.98,IF(C3=45,1,IF(C3=50,1.01,IF(C3=55,1.01,1.02)))))),0)","v":1},{"$error":"#VALUE!"},{"$error":"#VALUE!"},{"$error":"#N/A"},{"$error":"#VALUE!"},{"$f":"IF(G13*$K$10*$E$3>O13,O13,G13*$K$10*$E$3)","v":{"$error":"#VALUE!"}},{"$error":"#VALUE!"},{"$error":"#VALUE!"},{"$f":"INDEX('Liste communes'!H21:H28,'Liste communes'!A18,1)","v":{"$error":"#VALUE!"}},{"$error":"#VALUE!"},"Caen",{"$f":"$I$5*1","v":{"$error":"#N/A"}}]
["avril",{"$f":"INDEX('Liste communes'!BL20:BL29,'Liste communes'!A18,1)*31","v":{"$error":"#VALUE!"}},{"$f":"INDEX('Liste communes'!AJ20:AJ29,'Liste communes'!A18,1)","v":{"$error":"#VALUE!"}},{"$f":"IF(C14=0,0,ROUND($I$1-$I$2*(85-(POWER(C14,0.88)))/800,2))","v":{"$error":"#VALUE!"}},{"$f":"IF(B1<>\"\",ROUND(IF(OR($B$1=\"Ajaccio\",$B$1=\"Bastia\",$B$1=\"Gourdon\",$B$1=\"Marseille\",$B$1=\"Nice\",$B$1=\"St Auban\",$B$1=\"Toulon\"),IF(AND($F$1=\"Rural\",$C$5<=300),1.03,IF(AND($F$1=\"Rural\",$C$5>300,$C$5<=1100),(($C$5-300)*0.00004)+1.08,IF(AND($F$1=\"Rural\",$C$5>1100),(($C$5-300)*0.00004)+1.13,0.93))),IF(AND($F$1=\"Rural\",$C$5<=300),1,IF(AND($F$1=\"Rural\",$C$5>300,$C$5<=1100),(($C$5-300)*0.00004)+1.05,IF(AND($F$1=\"Rural\",$C$5>1100),(($C$5-300)*0.00004)+1.1,0.9)))),2),0)","v":{"$error":"#VALUE!"}},{"$f":"IF(C3<>\"\",IF(C3=30,0.96,IF(C3=35,0.97,IF(C3=40,0.99,IF(C3=45,1,IF(C3=50,1.01,IF(C3=55,1.01,1.02)))))),0)","v":1},{"$error":"#VALUE!"},{"$error":"#VALUE!"},{"$error":"#N/A"},{"$error":"#VALUE!"},{"$f":"IF(G14*$K$10*$E$3>O14,O14,G14*$K$10*$E$3)","v":{"$error":"#VALUE!"}},{"$error":"#VALUE!"},{"$error":"#VALUE!"},{"$f":"INDEX('Liste communes'!I21:I28,'Liste communes'!A18,1)","v":{"$error":"#VALUE!"}},{"$error":"#VALUE!"},"Carcassonne",{"$f":"$I$5*1","v":{"$error":"#N/A"}}]
["mai",{"$f":"INDEX('Liste communes'!BM20:BM29,'Liste communes'!A18,1)*31","v":{"$error":"#VALUE!"}},{"$f":"INDEX('Liste communes'!AK20:AK29,'Liste communes'!A18,1)","v":{"$error":"#VALUE!"}},{"$f":"IF(C15=0,0,ROUND($I$1-$I$2*(75-(POWER(C15,0.88)))/800,2))","v":{"$error":"#VALUE!"}},{"$f":"IF(B1<>\"\",ROUND(IF(OR($B$1=\"Ajaccio\",$B$1=\"Bastia\",$B$1=\"Gourdon\",$B$1=\"Marseille\",$B$1=\"Nice\",$B$1=\"St Auban\",$B$1=\"Toulon\"),IF(AND($F$1=\"Rural\",$C$5<=300),0.98,IF(AND($F$1=\"Rural\",$C$5>300,$C$5<=1100),(($C$5-300)*0.00004)+1.03,IF(AND($F$1=\"Rural\",$C$5>1100),(($C$5-300)*0.00004)+1.08,0.93))),IF(AND($F$1=\"Rural\",$C$5<=300),0.95,IF(AND($F$1=\"Rural\",$C$5>300,$C$5<=1100),(($C$5-300)*0.00004)+1,IF(AND($F$1=\"Rural\",$C$5>1100),(($C$5-300)*0.00004)+1.05,0.9)))),2),0)","v":{"$error":"#VALUE!"}},{"$f":"IF(C3<>\"\",IF(C3=30,0.99,IF(C3=35,0.99,IF(C3=40,1,IF(C3=45,1,IF(C3=50,1,IF(C3=55,0.99,0.99)))))),0)","v":1},{"$error":"#VALUE!"},{"$error":"#VALUE!"},{"$error":"#N/A"},{"$error":"#VALUE!"},{"$f":"IF(G15*$K$10*$E$3>O15,O15,G15*$K$10*$E$3)","v":{"$error":"#VALUE!"}},{"$error":"#VALUE!"},{"$error":"#VALUE!"},{"$f":"INDEX('Liste communes'!J21:J28,'Liste communes'!A18,1)","v":{"$error":"#VALUE!"}},{"$error":"#VALUE!"},"Cazaux",{"$f":"$I$5*1","v":{"$error":"#N/A"}}]
["juin",{"$f":"INDEX('Liste communes'!BN20:BN29,'Liste communes'!A18,1)*31","v":{"$error":"#VALUE!"}},{"$f":"INDEX('Liste communes'!AL20:AL29,'Liste communes'!A18,1)","v":{"$error":"#VALUE!"}},{"$f":"IF(C16=0,0,ROUND($I$1-$I$2*(75-(POWER(C16,0.88)))/800,2))","v":{"$error":"#VALUE!"}},{"$f":"IF(B1<>\"\",ROUND(IF(OR($B$1=\"Ajaccio\",$B$1=\"Bastia\",$B$1=\"Gourdon\",$B$1=\"Marseille\",$B$1=\"Nice\",$B$1=\"St Auban\",$B$1=\"Toulon\"),IF(AND($F$1=\"Rural\",$C$5<=300),0.98,IF(AND($F$1=\"Rural\",$C$5>300,$C$5<=1100),(($C$5-300)*0.00004)+1.03,IF(AND($F$1=\"Rural\",$C$5>1100),(($C$5-300)*0.00004)+1.08,0.93))),IF(AND($F$1=\"Rural\",$C$5<=300),0.95,IF(AND($F$1=\"Rural\",$C$5>300,$C$5<=1100),(($C$5-300)*0.00004)+1,IF(AND($F$1=\"Rural\",$C$5>1100),(($C$5-300)*0.00004)+1.05,0.9)))),2),0)","v":{"$error":"#VALUE!"}},{"$f":"IF(C3<>\"\",IF(C3=30,1.03,IF(C3=35,1.02,IF(C3=40,1.01,IF(C3=45,1,IF(C3=50,0.99,IF(C3=55,0.98,0.94)))))),0)","v":1},{"$error":"#VALUE!"},{"$error":"#VALUE!"},{"$error":"#N/A"},{"$error":"#VALUE!"},{"$f":"IF(G16*$K$10*$E$3>$I$5,$I$5,G16*$K$10*$E$3)","v":{"$error":"#VALUE!"}},{"$error":"#VALUE!"},{"$error":"#VALUE!"},{"$f":"INDEX('Liste communes'!K21:K28,'Liste communes'!A18,1)","v":{"$error":"#VALUE!"}},{"$error":"#VALUE!"},"Chartres",{"$f":"$I$5*0.9","v":{"$error":"#N/A"}}]
["juillet",{"$f":"INDEX('Liste communes'!BO20:BO29,'Liste communes'!A18,1)*31","v":{"$error":"#VALUE!"}},{"$f":"INDEX('Liste communes'!AM20:AM29,'Liste communes'!A18,1)","v":{"$error":"#VALUE!"}},{"$f":"IF(C17=0,0,ROUND($I$1-$I$2*(70-(POWER(C17,0.88)))/800,2))","v":{"$error":"#VALUE!"}},{"$f":"IF(B1<>\"\",ROUND(IF(OR($B$1=\"Ajaccio\",$B$1=\"Bastia\",$B$1=\"Gourdon\",$B$1=\"Marseille\",$B$1=\"Nice\",$B$1=\"St Auban\",$B$1=\"Toulon\"),IF(AND($F$1=\"Rural\",$C$5<=300),0.98,IF(AND($F$1=\"Rural\",$C$5>300,$C$5<=1100),(($C$5-300)*0.00004)+1.03,IF(AND($F$1=\"Rural\",$C$5>1100),(($C$5-300)*0.00004)+1.08,0.93))),IF(AND($F$1=\"Rural\",$C$5<=300),0.95,IF(AND($F$1=\"Rural\",$C$5>300,$C$5<=1100),(($C$5-300)*0.00004)+1,IF(AND($F$1=\"Rural\",$C$5>1100),(($C$5-300)*0.00004)+1.05,0.9)))),2),0)","v":{"$error":"#VALUE!"}},{"$f":"IF(C3<>\"\",IF(C3=30,1.04,IF(C3=35,1.03,IF(C3=40,1.02,IF(C3=45,1,IF(C3=50,0.98,IF(C3=55,0.96,0.94)))))),0)","v":1},{"$error":"#VALUE!"},{"$error":"#VALUE!"},{"$error":"#N/A"},{"$error":"#VALUE!"},{"$f":"IF(G17*$K$10*$E$3>$I$5,$I$5,G17*$K$10*$E$3)","v":{"$error":"#VALUE!"}},{"$error":"#VALUE!"},{"$error":"#VALUE!"},{"$f":"INDEX('Liste communes'!L21:L28,'Liste communes'!A18,1)","v":{"$error":"#VALUE!"}},{"$error":"#VALUE!"},"Clermont-Fd",{"$f":"$I$5*0.8","v":{"$error":"#N/A"}}]
["août",{"$f":"INDEX('Liste communes'!BP20:BP29,'Liste communes'!A18,1)*31","v":{"$error":"#VALUE!"}},{"$f":"INDEX('Liste communes'!AN20:AN29,'Liste communes'!A18,1)","v":{"$error":"#VALUE!"}},{"$f":"IF(C18=0,0,ROUND($I$1-$I$2*(70-(POWER(C18,0.88)))/800,2))","v":{"$error":"#VALUE!"}},{"$f":"IF(B1<>\"\",ROUND(IF(OR($B$1=\"Ajaccio\",$B$1=\"Bastia\",$B$1=\"Gourdon\",$B$1=\"Marseille\",$B$1=\"Nice\",$B$1=\"St Auban\",$B$1=\"Toulon\"),IF(AND($F$1=\"Rural\",$C$5<=300),0.98,IF(AND($F$1=\"Rural\",$C$5>300,$C$5<=1100),(($C$5-300)*0.00004)+1.03,IF(AND($F$1=\"Rural\",$C$5>1100),(($C$5-300)*0.00004)+1.08,0.93))),IF(AND($F$1=\"Rural\",$C$5<=300),0.95,IF(AND($F$1=\"Rural\",$C$5>300,$C$5<=1100),(($C$5-300)*0.00004)+1,IF(AND($F$1=\"Rural\",$C$5>1100),(($C$5-300)*0.00004)+1.05,0.9)))),2),0)","v":{"$error":"#VALUE!"}},{"$f":"IF(C3<>\"\",IF(C3=30,1.03,IF(C3=35,1.02,IF(C3=40,1.01,IF(C3=45,1,IF(C3=50,0.99,IF(C3=55,0.98,0.96)))))),0)","v":1},{"$error":"#VALUE!"},{"$error":"#VALUE!"},{"$error":"#N/A"},{"$error":"#VALUE!"},{"$f":"IF(G18*$K$10*$E$3>$I$5,$I$5,G18*$K$10*$E$3)","v":{"$error":"#VALUE!"}},{"$error":"#VALUE!"},{"$error":"#VALUE!"},{"$f":"INDEX('Liste communes'!M21:M28,'Liste communes'!A18,1)","v":{"$error":"#VALUE!"}},{"$error":"#VALUE!"},"Cognac",{"$f":"$I$5*0.8","v":{"$error":"#N/A"}}]
["septembre",{"$f":"INDEX('Liste communes'!BQ20:BQ29,'Liste communes'!A18,1)*31","v":{"$error":"#VALUE!"}},{"$f":"INDEX('Liste communes'!AO20:AO29,'Liste communes'!A18,1)","v":{"$error":"#VALUE!"}},{"$f":"IF(C19=0,0,ROUND($I$1-$I$2*(75-(POWER(C19,0.88)))/800,2))","v":{"$error":"#VALUE!"}},{"$f":"IF(B1<>\"\",ROUND(IF(OR($B$1=\"Ajaccio\",$B$1=\"Bastia\",$B$1=\"Gourdon\",$B$1=\"Marseille\",$B$1=\"Nice\",$B$1=\"St Auban\",$B$1=\"Toulon\"),IF(AND($F$1=\"Rural\",$C$5<=300),1.03,IF(AND($F$1=\"Rural\",$C$5>300,$C$5<=1100),(($C$5-300)*0.00004)+1.08,IF(AND($F$1=\"Rural\",$C$5>1100),(($C$5-300)*0.00004)+1.13,0.93))),IF(AND($F$1=\"Rural\",$C$5<=300),1,IF(AND($F$1=\"Rural\",$C$5>300,$C$5<=1100),(($C$5-300)*0.00004)+1.05,IF(AND($F$1=\"Rural\",$C$5>1100),(($C$5-300)*0.00004)+1.1,0.9)))),2),0)","v":{"$error":"#VALUE!"}},{"$f":"IF(C3<>\"\",IF(C3=30,0.99,IF(C3=35,0.99,IF(C3=40,1,IF(C3=45,1,IF(C3=50,1,IF(C3=55,0.99,0.99)))))),0)","v":1},{"$error":"#VALUE!"},{"$error":"#VALUE!"},{"$error":"#N/A"},{"$error":"#VALUE!"},{"$f":"IF(G19*$K$10*$E$3>$I$5,$I$5,G19*$K$10*$E$3)","v":{"$error":"#VALUE!"}},{"$error":"#VALUE!"},{"$error":"#VALUE!"},{"$f":"INDEX('Liste communes'!N21:N28,'Liste communes'!A18,1)","v":{"$error":"#VALUE!"}},{"$error":"#VALUE!"},"Colmar",{"$f":"$I$5*0.9","v":{"$error":"#N/A"}}]
["octobre",{"$f":"INDEX('Liste communes'!BR20:BR29,'Liste communes'!A18,1)*31","v":76.260000000000005},{"$f":"INDEX('Liste communes'!AP20:AP29,'Liste communes'!A18,1)","v":10.8},{"$f":"IF(C20=0,0,ROUND($I$1-$I$2*(75-(POWER(C20,0.88)))/800,2))","v":0.38},{"$f":"IF(B1<>\"\",ROUND(IF(OR($B$1=\"Ajaccio\",$B$1=\"Bastia\",$B$1=\"Gourdon\",$B$1=\"Marseille\",$B$1=\"Nice\",$B$1=\"St Auban\",$B$1=\"Toulon\"),IF(AND($F$1=\"Rural\",$C$5<=300),1.1,IF(AND($F$1=\"Rural\",$C$5>300,$C$5<=1100),(($C$5-300)*0.00004)+1.19,IF(AND($F$1=\"Rural\",$C$5>1100),(($C$5-300)*0.00004)+1.28,0.93))),IF(AND($F$1=\"Rural\",$C$5<=300),1.07,IF(AND($F$1=\"Rural\",$C$5>300,$C$5<=1100),(($C$5-300)*0.00004)+1.16,IF(AND($F$1=\"Rural\",$C$5>1100),(($C$5-300)*0.00004)+1.25,0.9)))),2),0)","v":{"$error":"#VALUE!"}},{"$f":"IF(C3<>\"\",IF(C3=30,0.95,IF(C3=35,0.96,IF(C3=40,0.98,IF(C3=45,1,IF(C3=50,1.01,IF(C3=55,1.01,1.02)))))),0)","v":1},{"$error":"#VALUE!"},{"$error":"#VALUE!"},{"$error":"#N/A"},{"$error":"#VALUE!"},{"$f":"IF(G20*$K$10*$E$3>O20,O20,G20*$K$10*$E$3)","v":{"$error":"#VALUE!"}},{"$error":"#VALUE!"},{"$error":"#VALUE!"},{"$f":"INDEX('Liste communes'!O21:O28,'Liste communes'!A18,1)","v":{"$error":"#VALUE!"}},{"$error":"#VALUE!"},"Dijon",{"$f":"$I$5*1","v":{"$error":"#N/A"}}]
["novembre",{"$f":"INDEX('Liste communes'!BS20:BS29,'Liste communes'!A18,1)*31","v":50.839999999999996},{"$f":"INDEX('Liste communes'!AQ20:AQ29,'Liste communes'!A18,1)","v":5.9},{"$f":"IF(C21=0,0,ROUND($I$1-$I$2*(80-(POWER(C21,0.88)))/800,2))","v":0.34},{"$f":"IF(B1<>\"\",ROUND(IF(OR($B$1=\"Ajaccio\",$B$1=\"Bastia\",$B$1=\"Gourdon\",$B$1=\"Marseille\",$B$1=\"Nice\",$B$1=\"St Auban\",$B$1=\"Toulon\"),IF(AND($F$1=\"Rural\",$C$5<=300),1.1,IF(AND($F$1=\"Rural\",$C$5>300,$C$5<=1100),(($C$5-300)*0.00004)+1.19,IF(AND($F$1=\"Rural\",$C$5>1100),(($C$5-300)*0.00004)+1.28,0.93))),IF(AND($F$1=\"Rural\",$C$5<=300),1.07,IF(AND($F$1=\"Rural\",$C$5>300,$C$5<=1100),(($C$5-300)*0.00004)+1.16,IF(AND($F$1=\"Rural\",$C$5>1100),(($C$5-300)*0.00004)+1.25,0.9)))),2),0)","v":{"$error":"#VALUE!"}},{"$f":"IF(C3<>\"\",IF(C3=30,0.93,IF(C3=35,0.94,IF(C3=40,0.96,IF(C3=45,1,IF(C3=50,1.01,IF(C3=55,1.02,1.03)))))),0)","v":1},{"$error":"#VALUE!"},{"$error":"#VALUE!"},{"$error":"#N/A"},{"$error":"#VALUE!"},{"$f":"IF(G21*$K$10*$E$3>O21,O21,G21*$K$10*$E$3)","v":{"$error":"#VALUE!"}},{"$error":"#VALUE!"},{"$error":"#VALUE!"},{"$f":"INDEX('Liste communes'!P21:P28,'Liste communes'!A18,1)","v":374},{"$error":"#VALUE!"},"Embrun",{"$f":"$I$5*1.1","v":{"$error":"#N/A"}}]
["décembre",{"$f":"INDEX('Liste communes'!BT20:BT29,'Liste communes'!A18,1)*31","v":38.75},{"$f":"INDEX('Liste communes'!AR20:AR29,'Liste communes'!A18,1)","v":0.5},{"$f":"IF(C22=0,0,ROUND($I$1-$I$2*(85-(POWER(C22,0.88)))/800,2))","v":0.3},{"$f":"IF(B1<>\"\",ROUND(IF(OR($B$1=\"Ajaccio\",$B$1=\"Bastia\",$B$1=\"Gourdon\",$B$1=\"Marseille\",$B$1=\"Nice\",$B$1=\"St Auban\",$B$1=\"Toulon\"),IF(AND($F$1=\"Rural\",$C$5<=300),1.1,IF(AND($F$1=\"Rural\",$C$5>300,$C$5<=1100),(($C$5-300)*0.00004)+1.19,IF(AND($F$1=\"Rural\",$C$5>1100),(($C$5-300)*0.00004)+1.28,0.93))),IF(AND($F$1=\"Rural\",$C$5<=300),1.07,IF(AND($F$1=\"Rural\",$C$5>300,$C$5<=1100),(($C$5-300)*0.00004)+1.16,IF(AND($F$1=\"Rural\",$C$5>1100),(($C$5-300)*0.00004)+1.25,0.9)))),2),0)","v":{"$error":"#VALUE!"}},{"$f":"IF(C3<>\"\",IF(C3=30,0.92,IF(C3=35,0.93,IF(C3=40,0.94,IF(C3=45,1,IF(C3=50,1.02,IF(C3=55,1.03,1.04)))))),0)","v":1},{"$error":"#VALUE!"},{"$error":"#VALUE!"},{"$error":"#N/A"},{"$error":"#VALUE!"},{"$f":"IF(G22*$K$10*$E$3>O22,O22,G22*$K$10*$E$3)","v":{"$error":"#VALUE!"}},{"$error":"#VALUE!"},{"$error":"#VALUE!"},{"$f":"INDEX('Liste communes'!Q21:Q28,'Liste communes'!A18,1)","v":542},{"$error":"#VALUE!"},"Gourdon",{"$f":"$I$5*1.1","v":{"$error":"#N/A"}}]
[null,null,null,null,null,null,null,null,null,null,null,null,null,null,null,"Grenoble",{"$f":"SUM(Q11:Q22)","v":{"$error":"#N/A"}}]
[null,"KWh/m²/an","T° moyenne/an","Rend. moyen/an","Coeff. moyen/an","Coeff. moyen/an","KWh/m²/an","KWh/an",null,"KWh/an","KWh/an",null,"KWh/an","Total DJU","KWh/an","La Rochelle"]
[null,{"$f":"SUM(B11:B22)","v":{"$error":"#VALUE!"}},{"$f":"ROUND(AVERAGE(C11:C22),2)","v":{"$error":"#VALUE!"}},{"$f":"ROUND(AVERAGE(D11:D22),2)","v":{"$error":"#VALUE!"}},{"$f":"ROUND(AVERAGE(E11:E22),2)","v":{"$error":"#VALUE!"}},{"$f":"ROUND(AVERAGE(F11:F22),2)","v":1},{"$f":"ROUND(SUM(G11:G22),2)","v":{"$error":"#VALUE!"}},{"$f":"SUM(H11:H22)","v":{"$error":"#VALUE!"}},null,{"$error":"#VALUE!"},{"$error":"#VALUE!"},null,{"$error":"#VALUE!"},{"$error":"#VALUE!"},{"$error":"#VALUE!"},"Langres"]
[null,null,null,null,"ECS seule","ECS+Chauffage",null,null,{"$f":"IF(K2=\"Fuel domestique\",\"Fuel en Litres\",IF(K2=\"Gaz de ville\",\"Gaz en M. Cube\",\"Combustible\"))","v":"Combustible"},null,null,null,null,null,null,"Le Mans"]
["Taux de couverture théorique en % :",null,null,null,{"$f":"IF(I4<>0,H25/$I$4,0)","v":{"$error":"#N/A"}},{"$f":"IF(O25<>0,K25/$O$25,0)","v":{"$error":"#VALUE!"}},"Consommation moyenne par an :",null,{"$f":"IF(AND(K1<>\"\",K2<>\"\"),IF(K2=\"Fuel domestique\",IF(K1=\"Brûleur à air soufflé\",O25/(10.25*0.95),IF(K1=\"Atmosphérique\",O25/(10.25*0.87),O25/(10.25*1.05))),IF(K2=\"Gaz de ville\",IF(K1=\"Brûleur à air soufflé\",O25/(10.53*0.95),IF(K1=\"Atmosphérique\",O25/(10.53*0.87),O25/(10.53*1.05))))),\"\")","v":false},null,null,null,null,null,null,"Le Puy-en-Velay"]
["Taux de couverture pratique en % :",null,null,null,{"$f":"E27*0.9","v":{"$error":"#N/A"}},{"$f":"F27*0.6","v":{"$error":"#VALUE!"}},"Economie ECS par an :",null,{"$f":"IF(AND(K1<>\"\",K2<>\"\"),IF(K2=\"Fuel domestique\",IF(K1=\"Brûleur à air soufflé\",H25/(10.25*0.95),IF(K1=\"Atmosphérique\",H25/(10.25*0.87),H25/(10.25*1.05))),IF(K2=\"Gaz de ville\",IF(K1=\"Brûleur à air soufflé\",H25/(10.53*0.95),IF(K1=\"Atmosphérique\",H25/(10.53*0.87),H25/(10.53*1.05))))),\"\")","v":false},null,null,null,null,null,null,"Lille"]
["Taux de rendement théorique du capteur en KWh/m²/an :",null,null,null,{"$f":"IF(E3<>\"\",H25/($E$3*$H$10),0)","v":{"$error":"#VALUE!"}},{"$f":"IF(E3<>\"\",K25/($E$3*$K$10),0)","v":{"$error":"#VALUE!"}},"Economie ECS + Chauffage par an :",null,{"$f":"IF(AND(K1<>\"\",K2<>\"\"),IF(K2=\"Fuel domestique\",IF(K1=\"Brûleur à air soufflé\",K25/(10.25*0.95),IF(K1=\"Atmosphérique\",K25/(10.25*0.87),K25/(10.25*1.05))),IF(K2=\"Gaz de ville\",IF(K1=\"Brûleur à air soufflé\",K25/(10.53*0.95),IF(K1=\"Atmosphérique\",K25/(10.53*0.87),K25/(10.53*1.05))))),\"\")","v":false},null,null,null,null,null,null,"Limoges"]
["Taux de rendement pratique du capteur en KWh/m²/an :",null,null,null,{"$f":"E29*0.9","v":{"$error":"#VALUE!"}},{"$f":"F29*0.9","v":{"$error":"#VALUE!"}},null,null,null,null,null,null,null,null,null,"Lyon"]
[null,null,null,null,null,null,null,null,null,null,null,null,null,null,null,"Marseille"]
[null,null,null,null,null,null,null,null,null,null,null,null,null,null,null,"Metz"]
["Les cellules à droite des étiquettes jaune doivent être renseignées.",null,null,null,null,null,null,null,null,null,null,null,null,null,null,"Millau"]
["Les cellules en bleu ciel comportent une liste déroulante dans laquelle un choix est à faire.",null,null,null,null,null,null,null,null,null,null,null,null,null,null,"Mont de Marsan"]
["Les cellules à droite des étiquettes vert clair indique une valeur pour information, ne rien inscrire car elles contiennent des formules.",null,null,null,null,null,null,null,null,null,null,null,null,null,null,"Montélimar"]
["Attention, certaines cellules contiennent des formules complexes. Si elles sont supprimées par erreur (si la protection a été ôtée), ne pas essayer de les reproduire, supprimer le classeur, et le récupérer à nouveau depuis le fichier zip.",null,null,null,null,null,null,null,null,null,null,null,null,null,null,"Montpellier"]
["Ce classeur contient des feuilles qui ont été cachées afin de ne pas l'encombrer inutilement. Elles peuvent être affichées en cliquant sur : Format|Feuille|Affichée…",null,null,null,null,null,null,null,null,null,null,null,null,null,null,"Mulhouse"]
["Afin d'éviter toutes fausses manœuvres, cette feuille ainsi que la feuille \"Piscine\" sont protégées. Pour ôter la protection, cliquer sur : Outils|Protection|Ôter la protection de la feuille… Note : aucun mot de passe n'est à saisir.",null,null,null,null,null,null,null,null,null,null,null,null,null,null,"Nancy"]
[null,null,null,null,null,null,null,null,null,null,null,null,null,null,null,"Nantes"]
[null,null,null,null,null,null,null,null,null,null,null,null,null,null,null,"Nice"]
[null,null,null,null,null,null,null,null,null,null,null,null,null,null,null,"Nimes"]
[null,null,null,null,null,null,null,null,null,null,null,null,null,null,null,"Orléans"]
[null,null,null,null,null,null,null,null,null,null,null,null,null,null,null,"Paris"]
[null,null,null,null,null,null,null,null,null,null,null,null,null,null,null,"Perpignan"]
[null,null,null,null,null,null,null,null,null,null,null,null,null,null,null,"Reims"]
[null,null,null,null,null,null,null,null,null,null,null,null,null,null,null,"Rennes"]
[null,null,null,null,null,null,null,null,null,null,null,null,null,null,null,"Rouen"]
[null,null,null,null,null,null,null,null,null,null,null,null,null,null,null,"Saint Auban"]
[null,null,null,null,null,null,null,null,null,null,null,null,null,null,null,"Saint Quentin"]
[null,null,null,null,null,null,null,null,null,null,null,null,null,null,null,"Sarreguemines"]
[null,null,null,null,null,null,null,null,null,null,null,null,null,null,null,"Strasbourg"]
[null,null,null,null,null,null,null,null,null,null,null,null,null,null,null,"Toulon"]
[null,null,null,null,null,null,null,null,null,null,null,null,null,null,null,"Toulouse"]
[null,null,null,null,null,null,null,null,null,null,null,null,null,null,null,"Tours"]
[null,null,null,null,null,null,null,null,null,null,null,null,null,null,null,"Valenciennes"]
[null,null,null,null,null,null,null,null,null,null,null,null,null,null,null,"Vichy"]

{"sheet":"Tarif combustible","index":4,"n_rows":28,"n_cols":24,"rows_kept":28,"cut":false,"hidden":true,"merged":[[11,1,12,1],[23,3,27,3]]}
[null,null,null,null,null,null,null,null,null,null,null,"co2",null,null,null,null,null,"ecs simpl","ecs compl",null,"appoint chauffage compl",null,"appoint chauffage simpl"]
[null,"ENR",null,"UNITE","= kwh PCS","= kwh PCI","= €/kWh","COEFF",null,null,null,"chauffage","ECS","REFR","ECLAIRAGE","AUTRES",null,{"$f":"Chauffage!A164","v":0},{"$f":"Chauffage!A91","v":0},null,{"$f":"Chauffage!B77","v":0},null,{"$f":"Chauffage!G151","v":0}]
[null,"Electricité",1,"kwh",1,1,0.15029999999999999,2.58,null,null,null,0.18,0.04,0.04,0.1,0.06,null,"Ballon avec résistance électrique",1,null,"Electricité",null,"Chauffage électrique",1]
[null,"Fioul domestique",1,"litre",10.667,{"$f":"1/9.97","v":0.10030090270812436},7.1999999999999995E-2,1,null,null,null,0.3,0.3,0.3,null,null,null,"Ballon Raccordé au système de chauffage",{"$f":"D17","v":0},null,"Fioul domestique",null,"Chaudière gaz",3]
[null,"Gaz naturel",1,"m3",1,{"$f":"1/10.66","v":9.3808630393996242E-2},0.05,1,null,null,null,0.23400000000000001,0.23400000000000001,0.23400000000000001,null,null,null,"Ballon thermodynamique",1,null,"Gaz naturel",null,"Chaudière fioul",2]
[null,"Gaz propane",1,"kg",13.8,{"$f":"1/12.6","v":7.9365079365079361E-2},0.13500000000000001,1,null,null,null,0.27400000000000002,0.27400000000000002,0.27400000000000002,null,null,null,"Ballon solaire lié au chauffage",{"$f":"S4","v":0},null,"Gaz propane",null,"appoint bois granulés",6]
[null,"Bois bûches",1,"stères",1865,{"$f":"1/1680","v":5.9523809523809529E-4},{"$f":"57.2/1680","v":3.4047619047619049E-2},0.6,null,null,null,1.2999999999999999E-2,1.2999999999999999E-2,null,null,null,null,"Ballon solaire avec appoint électrique",1,null,"Bois bûches",null,"Appoint bois bûches",5]
[null,"Granulé bois",1,"tonne",5106,{"$f":"1/4600","v":2.173913043478261E-4},{"$f":"311.42/4600","v":6.770000000000001E-2},0.6,null,null,null,1.2999999999999999E-2,1.2999999999999999E-2,null,null,null,null,"Chauffe bain gaz",3,null,"Granulé bois",null,"Capteurs solaires",1]
[null,"Plaquette bois",1,"tonne",2442,{"$f":"1/2200","v":4.5454545454545455E-4},{"$f":"59.2/2200","v":2.690909090909091E-2},0.6,null,null,null,1.2999999999999999E-2,1.2999999999999999E-2,null,null,null,null,null,null,null,"Plaquette bois",null,"Sans appoint",0]
[null,"Solaire",null,"kwh",null,null,null,null,null,null,null,null,null,null,null,null,null,null,null,null,null,null,{"$f":"INDEX(W3:X9,W2,2)","v":{"$error":"#VALUE!"}}]
[null,"sans appoint",1,null,1,1,0,0]
[null,"gaz butane",1,"kg",13.7,12.56,null,1]
[null,null,1,"m3",33.5,30.45,null,1]
[null,"charbon",1,"kg",9.2449999999999992,8.8889999999999993,null,1]
[null,"gaz propane",1,"m3"]
[]
[null,"Energie chauffage",null,null,{"$f":"IFERROR(VLOOKUP(Chauffage!B151,'Tarif combustible'!B3:H9,6,FALSE),\"sans appoint\")","v":"sans appoint"}]
[null,"Energie chauffage appoint",{"$f":"IF(Chauffage!H20=0,Chauffage!B77,'Tarif combustible'!W10)","v":0}]
[null,"Energie ECS",{"$f":"IF(Chauffage!H20=1,INDEX(R3:S8,R2,2),INDEX(R3:S8,S2,2))","v":{"$error":"#VALUE!"}}]
[]
[]
[]
[null,"abo elec"]
[null,"3 kVA",54.45,"0,1 503 €",{"$f":"C25*30","v":2652.6}]
[null,"6 kVA",88.42]
[null,"9 kVA",117.2]
[null,"12 kVA",180.11]
[null,"15 kVA",206.57]

{"sheet":"ETIQUETTES","index":5,"n_rows":51,"n_cols":26,"rows_kept":51,"cut":false,"hidden":true,"merged":[[37,21,37,24],[38,21,38,24],[21,2,22,3],[23,2,24,3],[25,2,26,3],[27,2,28,3],[25,10,26,10],[21,5,22,5],[23,5,24,5],[25,5,26,5],[27,5,28,5],[21,6,22,6],[23,6,24,6],[25,6,26,6],[27,6,28,6],[21,4,22,4],[33,2,34,3],[31,11,32,11],[23,11,24,11],[25,11,26,11],[27,11,28,11],[29,6,30,6],[31,6,32,6],[33,10,34,10],[29,2,30,3],[33,6,34,6],[29,5,30,5],[33,4,34,4],[27,4,28,4],[29,4,30,4],[31,4,32,4],[23,4,24,4],[31,5,32,5],[21,12,22,12],[23,8,24,9],[23,10,24,10],[23,12,24,12],[25,8,26,9],[21,11,22,11],[21,8,22,9],[21,10,22,10],[25,12,26,12],[33,5,34,5],[25,4,26,4],[33,12,34,12],[31,2,32,3],[31,8,32,9],[27,12,28,12],[29,8,30,9],[29,10,30,10],[29,12,30,12],[31,10,32,10],[31,12,32,12],[29,11,30,11],[33,11,34,11],[27,8,28,9],[27,10,28,10],[33,8,34,9]]}
[null,"Etiquette",{"$f":"IF(C13<=C4,1,IF(C13<=C5,2,IF(C13<=C6,3,IF(C13<=C7,4,IF(C13<=C8,5,IF(C13<=C9,6,7))))))","v":{"$error":"#N/A"}},null,null,null,"Etiquette",{"$f":"IF(H12<=H4,1,IF(H12<=H5,2,IF(H12<=H6,3,IF(H12<=H7,4,IF(H12<=H8,5,IF(H12<=H9,6,7))))))","v":{"$error":"#VALUE!"}}]
[]
[null,"Etiquette",null,null,null,null,"Etiquette"]
[null,"A",50,1,{"$f":"IF($C$13<=C4,1,0)","v":{"$error":"#N/A"}},null,1,6]
[null,"B",90,2,{"$f":"IF($C$13<=C6,IF($C$13>C5,1,0),0)","v":{"$error":"#N/A"}},null,2,10]
[null,"C",150,3,{"$error":"#N/A"},null,3,20]
[null,"D",230,4,{"$error":"#N/A"},null,4,35]
[null,"E",330,5,{"$error":"#N/A"},null,5,55]
[null,"F",450,6,{"$error":"#N/A"},null,6,80]
[null,"G",null,7,{"$error":"#N/A"},null,7]
[null,null,null,8,{"$f":"IF($C$13<=C12,IF($C$13>C11,1,0),0)","v":{"$error":"#N/A"}}]
[null,null,null,9,0,null,"CO2",{"$f":"Calcul!Q33","v":{"$error":"#VALUE!"}}]
[null,"Cep",{"$f":"Calcul!P33","v":{"$error":"#N/A"}}]
[]
[null,"Niveau saisie",7]
[]
[]
[]
[]
[]
[]
[]
[]
[]
[]
[]
[]
[]
[]
[]
[]
[]
[]
[]
[]
[]
[]
[null,null,null,null,null,null,null,null,null,null,null,null,null,null,null,null,null,null,null,null,null,"Consommations énergétiques (Cep)\n(kWh EP/m².an)",null,null,null,{"$f":"C13","v":{"$error":"#N/A"}}]
[null,null,null,null,null,null,null,null,null,null,null,null,null,null,null,null,null,null,null,null,null,"Emissions de gaz à effet de serre (GES)\n(kgéqCO2/m².an)",null,null,null,{"$f":"H12","v":{"$error":"#VALUE!"}}]
[]
[]
[]
[]
[null,null,null,null,null,null,null,null,null,null,null,null,null,null,null,null,null,null,null,null,null,null,null,null,null,{"$f":"Z38","v":{"$error":"#N/A"}}]
[null,null,null,null,null,null,null,null,null,null,null,null,null,null,null,null,null,null,null,null,null,null,null,null,null,{"$f":"Z44","v":{"$error":"#N/A"}}]
[null,null,null,null,null,null,null,null,null,null,null,null,null,null,null,null,null,null,null,null,null,null,null,null,null,{"$f":"Z45","v":{"$error":"#N/A"}}]
[null,null,null,null,null,null,null,null,null,null,null,null,null,null,null,null,null,null,null,null,null,null,null,null,null,{"$f":"Z45","v":{"$error":"#N/A"}}]
[null,null,null,null,null,null,null,null,null,null,null,null,null,null,null,null,null,null,null,null,null,null,null,null,null,{"$f":"Z39","v":{"$error":"#VALUE!"}}]
[null,null,null,null,null,null,null,null,null,null,null,null,null,null,null,null,null,null,null,null,null,null,null,null,null,{"$f":"Z48","v":{"$error":"#VALUE!"}}]
[null,null,null,null,null,null,null,null,null,null,null,null,null,null,null,null,null,null,null,null,null,null,null,null,null,{"$f":"Z49","v":{"$error":"#VALUE!"}}]
[null,null,null,null,null,null,null,null,null,null,null,null,null,null,null,null,null,null,null,null,null,null,null,null,null,{"$f":"Z50","v":{"$error":"#VALUE!"}}]

{"sheet":"Pont thermique","index":6,"n_rows":63,"n_cols":12,"rows_kept":63,"cut":false,"hidden":true,"merged":[[47,1,52,1],[47,2,49,2],[53,1,57,1],[53,2,56,2],[58,1,61,1],[58,2,59,2],[60,2,61,2],[51,2,52,2],[44,4,44,7],[44,8,44,11],[45,4,45,5],[45,6,45,7],[45,8,45,9],[45,10,45,11],[4,9,4,10],[34,2,34,3],[31,2,32,3],[31,4,32,4],[4,5,4,7],[33,2,33,3]]}
[]
[]
[]
[]
[null,null,null,null,null,"calcul AUTO",null,null,null,"Saisie intermédiaire"]
[null,null,null,null,null,"Longueur auto","psi auto","Déperditions (W/K)",null,"Psi","longueur","Déperditions"]
[null,"angle de deux murs extérieurs sortant",null,null,null,{"$f":"Saisies!E17*Saisies!E7*'surface auto'!G4","v":{"$error":"#VALUE!"}},{"$f":"INDEX('BDD typo'!$B$5:$AQ$16,'BDD typo'!$A$1,22)","v":{"$error":"#N/A"}},{"$f":"F7*G7","v":{"$error":"#VALUE!"}},null,{"$f":"Saisies!E66","v":0},{"$f":"Saisies!F66","v":0},{"$f":"J7*K7","v":0}]
[null,"angle de deux murs extérieurs rentrant",null,null,null,{"$f":"Saisies!E17*Saisies!E7*'surface auto'!H4","v":{"$error":"#VALUE!"}},{"$f":"INDEX('BDD typo'!$B$5:$AQ$16,'BDD typo'!$A$1,23)","v":{"$error":"#N/A"}},{"$f":"F8*G8","v":{"$error":"#VALUE!"}},null,{"$f":"Saisies!E67","v":0},{"$f":"Saisies!F67","v":0},0]
[null,"angle mur ext / refend",null,null,null,{"$f":"'surface auto'!J4*Saisies!E7*Saisies!E17","v":{"$error":"#VALUE!"}},{"$f":"INDEX('BDD typo'!$B$5:$AQ$16,'BDD typo'!$A$1,24)","v":{"$error":"#N/A"}},{"$f":"F9*G9","v":{"$error":"#VALUE!"}},null,{"$f":"Saisies!E68","v":0},{"$f":"Saisies!F68","v":0},0]
[null,"angle mur ext / cloison",null,null,null,null,null,null,null,{"$f":"Saisies!E69","v":0},{"$f":"Saisies!F69","v":0},0]
[null,null,null,null,null,null,null,null,null,{"$f":"Saisies!G66","v":0},{"$f":"Saisies!H66","v":0},0]
[null,"Mur ext / plancher ext (L8)",null,null,null,null,null,null,null,{"$f":"Saisies!G67","v":0},{"$f":"Saisies!H67","v":0},0]
[null,"Mur ext / plancher interm PSI ou PSI1 (L9)",null,null,null,{"$f":"'surface auto'!AR8*Saisies!E7","v":{"$error":"#VALUE!"}},{"$f":"INDEX('BDD typo'!$B$5:$AQ$16,'BDD typo'!$A$1,27)","v":{"$error":"#N/A"}},{"$f":"F13*G13","v":{"$error":"#VALUE!"}},null,{"$f":"Saisies!G68","v":0},{"$f":"Saisies!H68","v":0},0]
[null,"Mur ext / plancher interm PSI2 (L9)",null,null,null,null,null,null,null,{"$f":"Saisies!G69","v":0},{"$f":"Saisies!H69","v":0},0]
[null,"Mur ext / plafond lourds (L10)",null,null,null,null,null,null,null,null,"Total",{"$f":"SUM(L7:L14)","v":0}]
[null,"Mur ext / Terasse (L10)"]
[null,"Mur ext / plafond léger (L10)",null,null,null,{"$f":"IF(Saisies!G23=\"Sans plancher haut (mitoyen)\",0,'surface auto'!AR8)","v":{"$error":"#VALUE!"}},{"$f":"INDEX('BDD typo'!$B$5:$AQ$16,'BDD typo'!$A$1,31)","v":{"$error":"#N/A"}},{"$f":"F17*G17","v":{"$error":"#VALUE!"}}]
[null,"Refend / plancher ext/lnc PSI ou PSI1 (L8)"]
[null,"Refend / plancher ext/lnc PS2 ou PSI3 (L8)"]
[null,"Refend / plafond ext/lnc PSI ou PSI1 (L10)"]
[null,"Refend / plancher ext/lnc PS2 ou PSI3 (L10)"]
[null,"Refend / plafond léger"]
[null,"Divers (L8)"]
[null,"Divers (L9)"]
[null,"Divers (L10)"]
[null,"Autre Liaison Divers"]
[null,"Terre plein (L8)",null,null,null,{"$f":"IF(Saisies!E23=\"Sans plancher bas (mitoyen)\",0,'surface auto'!AR8)","v":{"$error":"#VALUE!"}},{"$f":"INDEX('BDD typo'!$B$5:$AQ$16,'BDD typo'!$A$1,41)","v":{"$error":"#N/A"}},{"$f":"F27*G27","v":{"$error":"#VALUE!"}}]
[null,"Pont Thermique ponctuel 3D"]
[null,null,"TOTAL L8","TOTAL L9","TOTAL L10",null,null,{"$f":"SUM(H7:H28)","v":{"$error":"#VALUE!"}}]
[null,"longueur",{"$f":"IF(Chauffage!H20=0,Saisies!F66,F$12+F$18+F$19+F$23+F$27)","v":0},{"$f":"IF(Chauffage!H20=0,Saisies!F67,F$13+F$14+F$24)","v":0},{"$f":"IF(Chauffage!H20=0,Saisies!F68,0)","v":0}]
[null,"Déperditions",{"$f":"IF(Chauffage!H20=0,L7,H12)","v":0},{"$f":"IF(Chauffage!H20=0,L8,H13)","v":0},{"$f":"IF(Chauffage!H20=0,L9,H17)","v":0}]
[null,null,"Déperditions totales des ponts thermiques (W/K)",null,{"$f":"IF(H29>0,H29,SUM(E7:E28))","v":{"$error":"#VALUE!"}},"resultat calcul pht auto"]
[]
[null,null,"Ponts thermiques Ubat ",null,{"$f":"C31+D31+E31","v":0}]
[null,null,"Ponts thermiques Ubat ref"]
[]
[]
[]
[]
[]
[]
[]
[null,"Catalogue des ponts thermiques en fonction de la typologie du bâti"]
[]
[null,null,null,null,"Bâti ancien",null,null,null,"Bâti récent"]
[null,null,null,null,"1850-1914",null,"1914-1945",null,"1945-1988",null,">1988"]
[null,null,null,null,"ind","collectif","ind","collectif","ind","collectif","ind","collectif"]
[null,"Facade/plancher","Plancher bas (L8)","Sur terre plein ",{"$f":"(0.22+0.15)/2","v":0.185},{"$f":"E48","v":0.185},{"$f":"E48","v":0.185},{"$f":"G48","v":0.185},0.05,0.05,0.05,0.05]
[null,null,null,"Sur local non chauffé",{"$f":"(0.22*2+0.3)/3","v":0.24666666666666667},{"$f":"E49","v":0.24666666666666667},{"$f":"E49","v":0.24666666666666667},{"$f":"G49","v":0.24666666666666667},{"$f":"(0.7+0.6)/2","v":0.64999999999999991},0.65,0.65,0.65]
[null,null,null,"Sur vide sanitaire",{"$f":"(0.2*2+0.3)/3","v":0.23333333333333331},{"$f":"E50","v":0.23333333333333331},{"$f":"E50","v":0.23333333333333331},{"$f":"G50","v":0.23333333333333331},{"$f":"(0.7+0.6)/2","v":0.64999999999999991},0.65,0.65,0.65]
[null,null,"Plancher intermédiaire (L9)","Courant",{"$f":"(0.82+0.55+0.65)/3","v":0.67333333333333334},{"$f":"(0.82+0.55)/2","v":0.68500000000000005},{"$f":"(0.82+0.55+0.65)/3","v":0.67333333333333334},{"$f":"(0.54+0.42)/2","v":0.48},{"$f":"(0.82+0.57)/2","v":0.69499999999999995},0.69499999999999995,{"$f":"(0.82+0.57)/2","v":0.69499999999999995},0.69499999999999995]
[null,null,"Plancher haut (L10)","Léger sur local non chauffé",0.14000000000000001,0.14000000000000001,0.14000000000000001,0.14000000000000001,0.1,0.1,0.1,0.1]
[null,null,null,"Couverture",0.05,0.05,0.05,0.05,0.05,0.05,0.05,0.05]
[null,"Refend/plancher","Plancher bas (L8)","Sur terre plein ",{"$f":"(0.1+0.03+0.02)","v":0.15},0.1,{"$f":"E54","v":0.15},{"$f":"F54","v":0.1},0.12,0.12,0.12,0.12]
[null,null,null,"Sur local non chauffé",0.09,0.09,0.09,0.09,0.09,0.09,0.09,0.09]
[null,null,null,"Sur vide sanitaire",{"$f":"(1.05+0.37+0.33)/3","v":0.58333333333333337},1.05,{"$f":"E56","v":0.58333333333333337},0.76,0.73,0.73,0.73,0.73]
[null,null,null,"refend mitoyen local non chauffé",{"$f":"(1.2+0.6)/2","v":0.89999999999999991},0.9,0.9,0.9,0.82,0.82,0.82,0.82]
[null,null,"Plancher haut (L10)","Léger sur local non chauffé",0.55000000000000004,0.55000000000000004,0.55000000000000004,0.55000000000000004,0.72,0.72,0.72,0.72]
[null,"facade/refend et angles","refend et mitoyen","refend",{"$f":"(1.03+0.58+0.44+0.85+0.33+0.27+1.15+0.29+0.09)/9","v":0.55888888888888888},1.03,{"$f":"E59","v":0.55888888888888888},{"$f":"1.03","v":1.03},{"$f":"(0.41+0.35+0.2)/3","v":0.32},0.32,0.32,0.32]
[null,null,null,"mitoyen",{"$f":"(1.22+0.88+0.71+0.57+1.38+0.62)/6","v":0.89666666666666661},1.22,{"$f":"E60","v":0.89666666666666661},1.22,{"$f":"(0.7+0.45+0.038+0.36)/4","v":0.38700000000000001},{"$f":"I60","v":0.38700000000000001},{"$f":"J60","v":0.38700000000000001},0.38700000000000001]
[null,null,"angles","sortant",{"$f":"(0.37+0.21+0)/3","v":0.19333333333333333},0.37,{"$f":"E61","v":0.19333333333333333},0.37,0.03,{"$f":"I61","v":0.03},0.03,0.03]
[null,null,null,"rentrant",{"$f":"(0.73+0.33+0.04)/3","v":0.3666666666666667},0.73,{"$f":"E62","v":0.3666666666666667},0.73,0.12,{"$f":"I62","v":0.12},0.12,0.12]
[null,"Sources : Guide ABC de POUJEt + RT 2005"]

{"sheet":"surface auto","index":7,"n_rows":46,"n_cols":50,"rows_kept":46,"cut":false,"hidden":true,"merged":[[6,46,6,50],[33,15,34,15],[35,15,36,15],[37,15,38,15],[39,15,40,15],[6,40,6,44],[9,15,9,21],[11,15,12,15],[13,15,14,15],[15,15,16,15],[10,18,10,19],[10,16,10,17],[17,15,18,15],[41,15,42,15],[19,15,20,15],[21,15,22,15],[29,15,29,21],[31,15,32,15],[30,16,30,17],[30,18,30,19],[5,1,5,8],[21,31,21,34],[0,31,0,38],[2,36,2,38],[13,36,13,38],[17,31,17,33],[14,28,14,29],[0,23,0,29],[2,24,2,26],[2,28,2,29],[9,23,9,26],[10,28,10,29],[6,28,6,29],[6,7,6,8],[1,6,1,9],[0,20,0,21],[37,7,38,7],[26,1,26,2],[6,1,6,2],[6,4,6,5],[15,7,16,7],[12,7,12,8],[35,7,36,7],[22,5,22,7],[29,5,29,6]]}
[null,null,null,null,null,null,null,null,null,null,null,null,null,null,null,null,"murs",null,null,null,"vitrage",null,null,"Ubat saisie intermédiaire",null,null,null,null,null,null,null,"Ubat saisie rapide",null,null,null,null,null,null,null,null,"surface toit incliné",{"$f":"IF(AQ3=\"faux\",IF(AQ2=1.5,(Saisies!E11*0.5)*1.4,(Saisies!E11/Saisies!E7)*1.4),0)","v":0},"comble perdus?"]
[null,"Mur sur local non chauffé","déper portes","surface porte def","u porte",null,"nombre de linéiques par bâtiment",null,null,null,null,null,null,null,null,{"$f":"VLOOKUP(Saisies!$E$6,'BDD typo'!$B$5:$C$10,2,FALSE)","v":{"$error":"#N/A"}},"Mauvaise isolation","Isolation moyenne",null,{"$f":"VLOOKUP(Saisies!$E$6,'BDD typo'!$B$5:$C$10,2,FALSE)","v":{"$error":"#N/A"}},"Mauvaise isolation","Isolation moyenne",null,null,null,null,null,null,null,null,null,null,null,null,null,null,null,null,null,null,"surface comble",{"$f":"IF(AQ3=\"vrai\",Saisies!E11/Saisies!E7,0)","v":{"$error":"#DIV/0!"}},{"$f":"Saisies!E7","v":0}]
[null,{"$f":"IF(OR(Saisies!F49<>0,Saisies!F50<>0,Saisies!F51<>0,Saisies!F52<>0),SUM(Saisies!I49:I52),'surface auto'!AP5*VLOOKUP(Saisies!E6,'BDD typo'!B5:G10,6,FALSE))","v":{"$error":"#DIV/0!"}},{"$f":"IF(OR(Saisies!F39<>0,Saisies!F40<>0),SUM(Saisies!I39:I40),D3*E3)","v":{"$error":"#N/A"}},{"$f":"0.9*2.1","v":1.8900000000000001},{"$f":"INDEX('BDD typo'!AR5:AR10,'surface auto'!P11,1)","v":{"$error":"#N/A"}},null,"angle-mext-sortant","angle-mext-rentrant","nb plancher inter","mext-refend",null,null,null,null,null,"Maison individuelle avant 48",{"$f":"'BDD typo'!G5","v":2},{"$f":"'BDD typo'!H5","v":1},null,"Maison individuelle avant 48",3.5,2.5,null,null,"Murs extérieur",null,null,null,"Murs intérieurs",null,null,null,{"$f":"Saisies!$M$165","v":0},"Déperditions murs",{"$f":"AG3","v":0},"périmetre (m)","Toiture",null,null,null,"Surface toiture ",{"$f":"IF(AP1=0,AP2,AP1)","v":{"$error":"#DIV/0!"}},{"$f":"IF(AQ2-INT(AQ2)=0,\"vrai\",\"faux\")","v":"vrai"}]
[null,null,null,null,null,null,{"$f":"INDEX(Saisies!M166:'Saisies'!O169,Saisies!M165,2)","v":{"$error":"#VALUE!"}},{"$f":"INDEX(Saisies!M166:'Saisies'!O169,Saisies!M165,3)","v":{"$error":"#VALUE!"}},{"$f":"Saisies!E7-1","v":-1},{"$f":"G4-2","v":{"$error":"#VALUE!"}},null,null,null,null,null,"Maison individuelle entre 49 et 74",1.8,0.9,null,"Maison individuelle entre 49 et 74",3.5,2.5,null,null,"Surface/longueur","U","Déperditions",null,"Surface/longueur","Déperditions",null,"surface de murs nord",{"$f":"INDEX($AP$11:$AS$14,$AG$3,1)","v":{"$error":"#VALUE!"}},{"$f":"AG4*IF(Saisies!$E$22=\"Mauvaise isolation\",VLOOKUP(Saisies!$E$6,'surface auto'!$P$3:$Q$8,2,FALSE),VLOOKUP(Saisies!$E$6,'surface auto'!$P$3:$R$8,3,FALSE))","v":{"$error":"#VALUE!"}},"Carré - Rectangle",{"$f":"(SQRT(Saisies!$E$11/Saisies!$E$7))*4","v":{"$error":"#DIV/0!"}},"Surface","U","Déperditions",null,"surface plancher",{"$f":"Saisies!E11/Saisies!E7","v":{"$error":"#DIV/0!"}}]
[null,null,null,null,null,null,null,null,null,null,null,null,null,null,null,"maison individuelle entre 75 et 88",1,0.8,null,"maison individuelle entre 75 et 88",3,2.1,null,"Mur Nord",{"$f":"Saisies!F41+Saisies!F42","v":0},{"$f":"(Saisies!E41*Saisies!F41+Saisies!E42*Saisies!F42)/(Saisies!F41+Saisies!F42)","v":{"$error":"#DIV/0!"}},{"$f":"IFERROR(Y5*Z5,0)","v":0},null,{"$f":"Saisies!F49+Saisies!F50+Saisies!F51+Saisies!F52","v":0},{"$f":"Saisies!I49+Saisies!I50+Saisies!I51+Saisies!I52","v":0},null,"surface de murs sud",{"$f":"INDEX($AP$11:$AS$14,$AG$3,2)","v":{"$error":"#VALUE!"}},{"$f":"AG5*IF(Saisies!$E$22=\"Mauvaise isolation\",VLOOKUP(Saisies!$E$6,'surface auto'!$P$3:$Q$8,2,FALSE),VLOOKUP(Saisies!$E$6,'surface auto'!$P$3:$R$8,3,FALSE))","v":{"$error":"#VALUE!"}},"Peu découpé ",{"$f":"$AJ$4*1.2","v":{"$error":"#DIV/0!"}},{"$f":"IF(U46=0,0,AP3)","v":{"$error":"#N/A"}},{"$f":"U46","v":{"$error":"#N/A"}},{"$f":"AK5*AL5","v":{"$error":"#N/A"}},null,"surface murs intérieurs",{"$f":"((INDEX(AJ4:AJ7,AG3,1)/4)*2.5)/2","v":{"$error":"#DIV/0!"}}]
[null,"Saisies Systèmes ",null,null,null,null,null,null,null,null,null,null,null,null,null,"maison individuelle entre 89 et 2005",0.5,0.35,null,"maison individuelle entre 89 et 2005",2.5,1.9,null,"Mur Sud",{"$f":"Saisies!F43+Saisies!F44","v":0},{"$f":"(Saisies!E43*Saisies!F43+Saisies!E44*Saisies!F44)/(Saisies!F43+Saisies!F44)","v":{"$error":"#DIV/0!"}},{"$f":"IFERROR(Y6*Z6,0)","v":0},null,null,null,null,"surace de murs est",{"$f":"INDEX($AP$11:$AS$14,$AG$3,3)","v":{"$error":"#VALUE!"}},{"$f":"AG6*IF(Saisies!$E$22=\"Mauvaise isolation\",VLOOKUP(Saisies!$E$6,'surface auto'!$P$3:$Q$8,2,FALSE),VLOOKUP(Saisies!$E$6,'surface auto'!$P$3:$R$8,3,FALSE))","v":{"$error":"#VALUE!"}},"très découpé",{"$f":"$AJ$5*1.25","v":{"$error":"#DIV/0!"}}]
[null,"Chauffage",null,null,"Chauffage appoint",null,null,"ECS",null,null,null,null,null,null,null,null,null,null,null,null,null,null,null,"Mur Est",{"$f":"Saisies!F45+Saisies!F46","v":0},{"$f":"(Saisies!E45*Saisies!F45+Saisies!E46*Saisies!F46)/(Saisies!F45+Saisies!F46)","v":{"$error":"#DIV/0!"}},{"$f":"IFERROR(Y7*Z7,0)","v":0},null,"Toiture",null,null,"surface de murs ouest",{"$f":"INDEX($AP$11:$AS$14,$AG$3,4)","v":{"$error":"#VALUE!"}},{"$f":"AG7*IF(Saisies!$E$22=\"Mauvaise isolation\",VLOOKUP(Saisies!$E$6,'surface auto'!$P$3:$Q$8,2,FALSE),VLOOKUP(Saisies!$E$6,'surface auto'!$P$3:$R$8,3,FALSE))","v":{"$error":"#VALUE!"}},"autres..",{"$f":"AJ5*1.5","v":{"$error":"#DIV/0!"}},null,null,null,null,"murs",null,null,null,null,null,"Mitoyenneté"]
[null,"Chauffage",{"$f":"IF(Chauffage!H20=2,INDEX(Chauffage!H36:H37,Chauffage!H35,1),Chauffage!H36)","v":"Chauffage individuel"},null,"Chauffage",{"$f":"C8","v":"Chauffage individuel"},null,"Système",{"$f":"IF(Chauffage!H20=0,INDEX(Chauffage!A92:A99,Chauffage!A91,1),INDEX(Chauffage!A165:A170,Chauffage!A164,1))","v":{"$error":"#VALUE!"}},null,null,null,null,null,null,null,null,null,null,null,null,null,null,"Mur Ouest",{"$f":"Saisies!F48+Saisies!F47","v":0},{"$f":"(Saisies!E48*Saisies!F48+Saisies!E47*Saisies!F47)/(Saisies!F47+Saisies!F48)","v":{"$error":"#DIV/0!"}},{"$f":"IFERROR(Y8*Z8,0)","v":0},null,"Surface/longueur","Déperditions",null,"Total surface de murs",{"$f":"SUM(AG4:AG7)-AH15","v":{"$error":"#VALUE!"}},{"$f":"AH4+AH5+AH6+AH7","v":{"$error":"#VALUE!"}},null,null,null,null,null,null,"hauteur mur",null,"perimetre retenu",{"$f":"INDEX(AI4:AJ7,AI3,2)","v":{"$error":"#VALUE!"}},null,null,null,null,"Pourcentage de paroie déperditive en moins"]
[null,"Emission",{"$f":"IF(Chauffage!H20=0,INDEX(Chauffage!A36:A40,Chauffage!B35,1),INDEX(Chauffage!A129:A133,Chauffage!B128,1))","v":{"$error":"#VALUE!"}},null,"Emission",{"$f":"IF(Chauffage!H20=0,INDEX(Chauffage!A65:A68,Chauffage!B64,1),\"Emission auto\")","v":{"$error":"#VALUE!"}},null,"Energie principale ECS",{"$f":"IF(Chauffage!H20=0,INDEX(Chauffage!G92:G97,Chauffage!A91),INDEX(Chauffage!E165:E170,Chauffage!A164))","v":{"$error":"#VALUE!"}},null,null,null,null,null,null,null,null,null,null,null,null,null,null,null,{"$f":"SUM(Y5:Y8)","v":0},null,{"$f":"SUM(AA5:AA8)","v":0},null,{"$f":"SUM(Saisies!F53:F56)","v":0},{"$f":"Saisies!I53+Saisies!I54+Saisies!I55+Saisies!I56","v":0},null,null,null,null,null,null,null,null,null,null,{"$f":"ROUNDDOWN(Saisies!E7,0)*Saisies!E17","v":0},null,null,null,null,null,"Numéro de ligne","Indépendant",0,{"$f":"1-AW9","v":1}]
[null,"Rendement",{"$f":"IF(Chauffage!H20=0,INDEX(Chauffage!A36:B40,Chauffage!B35,2),INDEX(Chauffage!B129:B133,Chauffage!B128,1))","v":{"$error":"#VALUE!"}},null,"Rendement",{"$f":"IF(Chauffage!H20=0,INDEX(Chauffage!A65:B68,Chauffage!B64,2),95)","v":{"$error":"#VALUE!"}},null,"Rendement global",{"$f":"IF(Chauffage!H20=0,IF(Chauffage!A91=2,C14*(I11/100),I11),IF(Chauffage!A164=2,C14*(I11/100),I11))","v":{"$error":"#VALUE!"}},null,null,null,null,null,"Type de plancher","Plancher",null,null,null,null,null,null,null,"Vitrages",null,null,null,null,null,null,null,null,null,null,"U","Déperditions vitrages",null,null,null,null,null,"snord","ssud","souest","sest",null,{"$f":"Saisies!$P$166","v":0},"1 petit coté",0.2,0.8]
[null,"Distribution",{"$f":"IF(Chauffage!H20=0,INDEX(Chauffage!A43:C46,Chauffage!D42,1),INDEX(Chauffage!B136:B138,Chauffage!A135,1))","v":{"$error":"#VALUE!"}},null,"Distribution",{"$f":"IF(Chauffage!H20=0,IF(Chauffage!E77=1,Chauffage!A75,IF(Chauffage!E77=2,Chauffage!A74,Chauffage!A73)),\"Distribution auto\")","v":" Tuyaux non calorifugées"},null,"rendement ballon",{"$f":"IF(Chauffage!H20=0,Chauffage!G91,Chauffage!I164)","v":{"$error":"#VALUE!"}},null,null,null,null,null,{"$f":"Saisies!E23","v":0},{"$f":"VLOOKUP(Saisies!$E$6,'BDD typo'!$B$5:$C$10,2,FALSE)","v":{"$error":"#N/A"}},"Mauvaise isolation",null,"Isolation moyenne",null,"Mauvaise isolation","Isolation moyenne",null,null,"Surface/longueur","U","Déperditions",null,"Plancher",null,null,"surface vitrée Nord",{"$f":"VLOOKUP(Saisies!$E$6,'BDD typo'!$B$5:$V$10,18,FALSE)","v":{"$error":"#N/A"}},{"$f":"AG11*AH15","v":{"$error":"#N/A"}},{"$f":"IF(Saisies!$E$22=\"Mauvaise isolation\",VLOOKUP(Saisies!$E$6,'surface auto'!$T$3:$U$8,2,FALSE),VLOOKUP(Saisies!$E$6,'surface auto'!$T$3:$V$8,3,FALSE))","v":{"$error":"#N/A"}},{"$f":"AH11*AI11","v":{"$error":"#N/A"}},null,null,null,null,{"$f":"AI4","v":"Carré - Rectangle"},{"$f":"IF(AU10=1,AJ4/4*AO9,(AJ4/4*AO9)*INDEX(AX9:AX14,AU10,1))","v":{"$error":"#DIV/0!"}},{"$f":"AP11","v":{"$error":"#DIV/0!"}},{"$f":"AQ11","v":{"$error":"#DIV/0!"}},{"$f":"AR11","v":{"$error":"#DIV/0!"}},null,null,"2 petits cotés",0.4,0.6]
[null,"Rendement",{"$f":"IF(Chauffage!H20=0,INDEX(Chauffage!B43:B46,Chauffage!D42,1),INDEX(Chauffage!C136:C138,Chauffage!A135,1))","v":{"$error":"#VALUE!"}},null,"Rendement",{"$f":"IF(Chauffage!H20=0,IF(F17=\"Electricité\",100,IF(Chauffage!E77=1,Chauffage!B75,IF(Chauffage!E77=2,Chauffage!B74,Chauffage!B73))),95)","v":{"$error":"#VALUE!"}},null,null,null,null,null,null,null,null,null,"Maison individuelle avant 48","Vide Sanitaire",0.9,"Vide Sanitaire",0.25,{"$f":"IF(AND(P11=1,O11=\"Vide Sanitaire\"),R12,IF(AND(P11=1,O11=\"Terre Plein\"),R13,0))","v":{"$error":"#N/A"}},{"$f":"IF(AND(P11=1,O11=\"Vide Sanitaire\"),T12,IF(AND(P11=1,O11=\"Terre Plein\"),T13,0))","v":{"$error":"#N/A"}},null,"Nord",{"$f":"Saisies!F31+Saisies!F32","v":0},{"$f":"(Saisies!E31*Saisies!F31+Saisies!E32*Saisies!F32)/(Saisies!F31+Saisies!F32)","v":{"$error":"#DIV/0!"}},{"$f":"IFERROR(Y12*Z12,0)","v":0},null,"Surface/longueur","Déperditions",null,"surface vitrée Sud",{"$f":"VLOOKUP(Saisies!$E$6,'BDD typo'!$B$5:$V$10,18,FALSE)","v":{"$error":"#N/A"}},{"$f":"AG12*AH15","v":{"$error":"#N/A"}},{"$f":"IF(Saisies!$E$22=\"Mauvaise isolation\",VLOOKUP(Saisies!$E$6,'surface auto'!$T$3:$U$8,2,FALSE),VLOOKUP(Saisies!$E$6,'surface auto'!$T$3:$V$8,3,FALSE))","v":{"$error":"#N/A"}},{"$f":"AH12*AI12","v":{"$error":"#N/A"}},null,null,null,null,{"$f":"AI5","v":"Peu découpé "},{"$f":"IF(AU10=1,AJ5/4*AO9,(AJ5/4*AO9)*INDEX(AX9:AX14,AU10,1))","v":{"$error":"#DIV/0!"}},{"$f":"AP12","v":{"$error":"#DIV/0!"}},{"$f":"AP12","v":{"$error":"#DIV/0!"}},{"$f":"AP12","v":{"$error":"#DIV/0!"}},null,null,"1 petit et 1 grand",0.5,0.5]
[null,"Système",{"$f":"IF(Chauffage!H20=0,INDEX(Chauffage!H42:H51,Chauffage!H41,1),INDEX(Chauffage!H135:H143,Chauffage!H134,1))","v":{"$error":"#VALUE!"}},null,"système",{"$f":"IF(Chauffage!H20=0,INDEX(Chauffage!H71:H80,Chauffage!H70,1),\"Emission auto\")","v":{"$error":"#VALUE!"}},null,"VMC",null,null,null,null,null,null,"Vide Sanitaire",null,"Terre plein",0.6,"Terre plein",0.25,null,null,null,"Sud",{"$f":"Saisies!F33+Saisies!F34","v":0},{"$f":"(Saisies!E33*Saisies!F33+Saisies!F34*Saisies!E34)/(Saisies!F33+Saisies!F34)","v":{"$error":"#DIV/0!"}},{"$f":"IFERROR(Y13*Z13,0)","v":0},null,{"$f":"Saisies!F57+Saisies!F58+Saisies!F59+Saisies!F60+Saisies!F61+Saisies!F62+Saisies!F63+Saisies!F64","v":0},{"$f":"SUM(Saisies!I57:I64)","v":0},null,"surface vitrée Est",{"$f":"VLOOKUP(Saisies!$E$6,'BDD typo'!$B$5:$V$10,18,FALSE)","v":{"$error":"#N/A"}},{"$f":"AG13*AH15","v":{"$error":"#N/A"}},{"$f":"IF(Saisies!$E$22=\"Mauvaise isolation\",VLOOKUP(Saisies!$E$6,'surface auto'!$T$3:$U$8,2,FALSE),VLOOKUP(Saisies!$E$6,'surface auto'!$T$3:$V$8,3,FALSE))","v":{"$error":"#N/A"}},{"$f":"AH13*AI13","v":{"$error":"#N/A"}},null,null,null,null,{"$f":"AI6","v":"très découpé"},{"$f":"IF(AU10=1,AJ6/4*AO9,(AJ6/4*AO9)*INDEX(AX9:AX14,AU10,1))","v":{"$error":"#DIV/0!"}},{"$f":"AP13","v":{"$error":"#DIV/0!"}},{"$f":"AP13","v":{"$error":"#DIV/0!"}},{"$f":"AP13","v":{"$error":"#DIV/0!"}},null,null,"1 grand coté",0.3,0.7]
[null,"Rendement",{"$f":"IF(Calcul!L68<>0,Calcul!L68,IF(Chauffage!H20=0,IF(Calcul!L68<>0,Calcul!L68,IF(Chauffage!E42=1,INDEX(Chauffage!I42:I51,Chauffage!H41,1),IF(Chauffage!E42=2,INDEX(Chauffage!H42:J51,Chauffage!H41,3),IF(Chauffage!E42=3,INDEX(Chauffage!H42:K51,Chauffage!H41,4),0)))),INDEX(Chauffage!I135:I143,Chauffage!H134,1)))","v":0},null,"PRODUCTION",{"$f":"Chauffage!I83","v":{"$error":"#VALUE!"}},null,"Type de renouvellement d'air",{"$f":"INDEX(Ventilation!C35:C46,Ventilation!B35,1)","v":{"$error":"#VALUE!"}},null,null,null,null,null,"Terre plein","Maison individuelle entre 49 et 74","Vide Sanitaire",0.9,"Vide Sanitaire",0.3,{"$f":"IF(AND(P11=2,O11=\"Vide Sanitaire\"),R14,IF(AND(P11=2,O11=\"Terre Plein\"),R15,0))","v":{"$error":"#N/A"}},{"$f":"IF(AND(P11=2,O11=\"Vide Sanitaire\"),T14,IF(AND(P11=2,O11=\"Terre Plein\"),T15,0))","v":{"$error":"#N/A"}},null,"Est",{"$f":"Saisies!F35+Saisies!F36","v":0},{"$f":"(Saisies!E35*Saisies!F35+Saisies!E36*Saisies!F36)/(Saisies!F35+Saisies!F36)","v":{"$error":"#DIV/0!"}},{"$f":"IFERROR(Y14*Z14,0)","v":0},null,null,null,null,"surface vitrée Ouest",{"$f":"VLOOKUP(Saisies!$E$6,'BDD typo'!$B$5:$V$10,18,FALSE)","v":{"$error":"#N/A"}},{"$f":"AG14*AH15","v":{"$error":"#N/A"}},{"$f":"IF(Saisies!$E$22=\"Mauvaise isolation\",VLOOKUP(Saisies!$E$6,'surface auto'!$T$3:$U$8,2,FALSE),VLOOKUP(Saisies!$E$6,'surface auto'!$T$3:$V$8,3,FALSE))","v":{"$error":"#N/A"}},{"$f":"AH14*AI14","v":{"$error":"#N/A"}},"Plancher",null,null,null,{"$f":"AI7","v":"autres.."},{"$f":"IF(AU10=1,AJ7/4*AO9,(AJ7/4*AO9)*INDEX(AX9:AX14,AU10,1))","v":{"$error":"#DIV/0!"}},{"$f":"AP14","v":{"$error":"#DIV/0!"}},{"$f":"AP14","v":{"$error":"#DIV/0!"}},{"$f":"AP14","v":{"$error":"#DIV/0!"}},null,null,"2 grands cotés",0.6,0.4]
[null,"Régulation",{"$f":"IF(Chauffage!H20=0,IF(Chauffage!E42=1,Chauffage!E75,IF(Chauffage!E42=2,Chauffage!E74,Chauffage!E73)),\"Régulation auto\")","v":"Régulation + plancher chauffant, ou Emetteur ne permettant pas un arrêt total de l'émission"},null,"Régulation","auto",null,null,null,null,null,null,null,null,"Sans plancher bas (mitoyen)",null,"Terre plein",0.6,"Terre plein",0.22,null,null,null,"Ouest",{"$f":"Saisies!F37+Saisies!F38","v":0},{"$f":"(Saisies!E37*Saisies!F37+Saisies!E38*Saisies!F38)/(Saisies!F37+Saisies!F38)","v":{"$error":"#DIV/0!"}},{"$f":"IFERROR(Y15*Z15,0)","v":0},null,"Portes",null,null,null,"Surface totale vitrages",{"$f":"1/6*Saisies!E11","v":0},"F8 est égale à 1/6 surface vitrée/surface totale",{"$f":"AJ11+AJ12+AJ13+AJ14","v":{"$error":"#N/A"}},"Surface","U","Déperditions"]
[null,"Rendement",{"$f":"IF(Chauffage!H20=0,INDEX(Chauffage!G26:G29,Chauffage!G25,1),95)","v":{"$error":"#VALUE!"}},null,"Rendement",{"$f":"IF(Chauffage!H20=0,IF(Chauffage!E77=1,94,IF(Chauffage!E77=2,92,88)),94)","v":88},null,null,null,null,null,null,null,null,null,"maison individuelle entre 75 et 88","Vide Sanitaire",0.9,"Vide Sanitaire",0.25,{"$f":"IF(AND(P11=3,O11=\"Vide Sanitaire\"),R16,IF(AND(P11=3,O11=\"Terre Plein\"),R17,0))","v":{"$error":"#N/A"}},{"$f":"IF(AND(P11=3,O11=\"Vide Sanitaire\"),T16,IF(AND(P11=3,O11=\"Terre Plein\"),T17,0))","v":{"$error":"#N/A"}},null,"Autre",{"$f":"Saisies!F30","v":0},{"$f":"Saisies!E30","v":" "},{"$f":"IFERROR(Y16*Z16,0)","v":0},null,"Surface/longueur","Déperditions",null,null,null,null,null,null,{"$f":"IF(U26=0,0,AP4)","v":{"$error":"#N/A"}},{"$f":"U26","v":{"$error":"#N/A"}},{"$f":"AK16*AL16","v":{"$error":"#N/A"}}]
[null,"Combustible Chauffage",{"$f":"IF(Chauffage!H20=0,INDEX('Tarif combustible'!B3:B9,'Tarif combustible'!C17,1),INDEX('Tarif combustible'!B3:H9,'Tarif combustible'!D17,1))","v":{"$error":"#VALUE!"}},null,"Energie Appoint chauffage",{"$f":"IF(Chauffage!H20=0,INDEX('Tarif combustible'!B3:B11,'Tarif combustible'!C18,1),INDEX(Chauffage!F152:F158,Chauffage!G151,1))","v":{"$error":"#VALUE!"}},null,null,null,null,null,null,null,null,null,null,"Terre plein",0.4,"Terre plein",0.22,null,null,null,null,{"$f":"SUM(Y12:Y16)","v":0},"Total",{"$f":"SUM(AA12:AA16)","v":0},null,{"$f":"Saisies!F39+Saisies!F40","v":0},{"$f":"Saisies!I39+Saisies!I40","v":0}]
[null,"Rendement global",{"$f":"(C14/100)*(C12/100)*(C10/100)*(C16/100)","v":{"$error":"#VALUE!"}},null,"Rendement global",{"$f":"(F10/100)*(F12/100)*(F16/100)*(F14/100)","v":{"$error":"#VALUE!"}},null,null,null,null,null,null,null,null,null,"maison individuelle entre 89 et 2005","Vide Sanitaire",0.6,"Vide Sanitaire",0.2,{"$f":"IF(AND(P11=4,O11=\"Vide Sanitaire\"),R18,IF(AND(P11=4,O11=\"Terre Plein\"),R19,0))","v":{"$error":"#N/A"}},{"$f":"IF(AND(P11=4,O11=\"Vide Sanitaire\"),T18,IF(AND(P11=4,O11=\"Terre Plein\"),T19,0))","v":{"$error":"#N/A"}},null,"Déperditions totales",{"$f":"AA9+AA17+AD5+AD9+AD13+AD17+'Pont thermique'!E34","v":0},"Ubat ",{"$f":"IFERROR(IF(Chauffage!H20=1,0,Y18/Y19),0)","v":0},null,null,null,null,"Portes "]
[null,null,null,null,null,null,null,null,null,null,null,null,null,null,null,null,"Terre plein",0.4,"Terre plein",0.2,null,null,null,"Surface totale",{"$f":"Y17+Y9+AC17+AC13+AC9+AC5","v":0},null,null,null,null,null,null,"Surface","U","Déperditions"]
[null,null,null,null,null,null,null,null,null,null,null,null,null,null,null,null,null,null,null,null,null,null,null,"hors plancher",{"$f":"Y19-AC13","v":0},null,null,null,null,null,null,{"$f":"0.9*2.1","v":1.8900000000000001},2.5,{"$f":"AF20*AG20","v":4.7250000000000005}]
[null,"Aucune étanchéité à l'air (Q4 = 3)",3,null,null,null,null,null,null,null,null,null,null,null,null,null,null,null,null,null,null,null,null,"Deper + pth autres",{"$f":"AA9+AA17+AD5+AD9+AD13+AD17+'Pont thermique'!L15","v":0},"Ubat tot",{"$f":"IFERROR(IF(Chauffage!H20=1,0,Y21/Y19),0)","v":0}]
[null,"mauvaise étanchéité (Q4 = 2)",2,null,null,null,null,null,null,null,null,null,null,null,null,null,null,null,null,null,null,null,null,null,null,null,null,null,null,null,null,"Mur intérieur"]
[null,"Bonne étanchéité (Q4 = 1,2",1.2,null,null,"Présence d'un système solaire réalisant une part des consommations",null,null,null,null,null,null,null,null,null,null,null,null,null,null,null,null,null,null,null,null,null,null,null,null,null,"Surface","U","Petit b","Déperditions"]
[null,"Etanchéité à l'air traité Q4 = 0,8",0.8,null,null,null,"Saisie simp","Saisie int",null,null,null,null,null,null,null,null,null,null,null,"Valeur retenue",{"$f":"SUM(U12:U23)","v":{"$error":"#N/A"}},{"$f":"SUM(V12:V23)","v":{"$error":"#N/A"}},null,"u",null,"u",null,"u","u",null,null,{"$f":"AP5","v":{"$error":"#DIV/0!"}},{"$f":"IF(Saisies!$E$22=\"Mauvaise isolation\",VLOOKUP(Saisies!$E$6,'surface auto'!$P$3:$Q$8,2,FALSE),VLOOKUP(Saisies!$E$6,'surface auto'!$P$3:$R$8,3,FALSE))","v":{"$error":"#N/A"}},{"$f":"0.8","v":0.8},{"$f":"AF24*AG24*AH24","v":{"$error":"#DIV/0!"}}]
[null,"autres.. Valeur perso",{"$f":"IF(A21<5,INDEX(C21:C24,A21,1),\"saisir valeur ici\")","v":{"$error":"#VALUE!"}},null,null,"Chauff",{"$f":"IF(Chauffage!G151=6,\"Solaire\",\"NON\")","v":"NON"},{"$f":"IF(Chauffage!H70=10,\"Solaire\",\"NON\")","v":"NON"},null,null,null,null,null,null,null,null,null,null,null,null,null,null,null,{"$f":"(Saisies!E49*Saisies!F49+Saisies!E50*Saisies!F50+Saisies!E51*Saisies!F51+Saisies!E52*Saisies!F52)/(Saisies!F49+Saisies!F50+Saisies!F51+Saisies!F52)","v":{"$error":"#DIV/0!"}},null,{"$f":"(Saisies!E53*Saisies!F53+Saisies!E54*Saisies!F54+Saisies!E55*Saisies!F55+Saisies!E56*Saisies!F56)/(Saisies!F53+Saisies!F54+Saisies!F55+Saisies!F56)","v":{"$error":"#DIV/0!"}},null,{"$f":"(Saisies!E57*Saisies!F57+Saisies!E58*Saisies!F58+Saisies!E59*Saisies!F59+Saisies!E60*Saisies!F60+Saisies!E61*Saisies!F61+Saisies!E62*Saisies!F62+Saisies!E63*Saisies!F63+Saisies!E64*Saisies!F64)/(Saisies!F57+Saisies!F58+Saisies!F59+Saisies!F60+Saisies!F61+Saisies!F62+Saisies!F63+Saisies!F64)","v":{"$error":"#DIV/0!"}},{"$f":"(Saisies!E39*Saisies!F39+Saisies!E40*Saisies!F40)/(Saisies!F39+Saisies!F40)","v":{"$error":"#DIV/0!"}},null,null,null,null,null,null,null,"Ubat",{"$f":"(AI26+'Pont thermique'!E34)/AG26","v":{"$error":"#DIV/0!"}}]
[null,null,null,null,null,"ECS",{"$f":"IF(Chauffage!A164=4,\"Solaire\",\"NON\")","v":"NON"},{"$f":"IF(Chauffage!A91=4,\"Solaire\",\"NON\")","v":"NON"},null,null,null,null,null,null,null,null,null,null,null,"Valeur du U de la paroie par typologie de bâtiment",{"$f":"IF(Saisies!E22=\"Mauvaise isolation\",'surface auto'!U24,'surface auto'!V24)","v":{"$error":"#N/A"}},null,null,null,null,null,null,null,null,null,null,"Surface totale",{"$f":"AF20+AK5+AF24+AK16+AH15+AG8","v":{"$error":"#N/A"}},"deper totales",{"$f":"AI24+AH20+AM16+AJ15+AH8+AM5","v":{"$error":"#DIV/0!"}},null,"ubat tot",{"$f":"(AI26+ 'Pont thermique'!H29)/AG26","v":{"$error":"#DIV/0!"}}]
[null,null,null,null,null,"ECS",{"$f":"IF(Chauffage!A164=5,\"Solaire\",\"NON\")","v":"NON"},{"$f":"IF(Chauffage!A91=5,\"Solaire\",\"NON\")","v":"NON"},null,null,null,null,null,null,null,null,null,null,null,null,null,null,null,null,null,null,null,null,null,null,null,"hors plancher",{"$f":"AG26-AK16","v":{"$error":"#N/A"}}]
[]
[]
[null,null,null,null,null,"Production Solaire à soustraire aux consommations",null,null,null,null,null,null,null,null,"Type de toiture","Toiture"]
[null,null,null,null,null,"Chauffage",{"$f":"IF(AND(Chauffage!H20=1,'surface auto'!G25=\"Solaire\"),SOLAIRE!G25*SOLAIRE!E3,IF(AND(Chauffage!H20=0,'surface auto'!H25=\"Solaire\"),SOLAIRE!G25*SOLAIRE!E3,0))","v":0},null,null,null,null,null,null,null,{"$f":"Saisies!$G$23","v":0},{"$f":"VLOOKUP(Saisies!E6,'BDD typo'!B5:C10,2,FALSE)","v":{"$error":"#N/A"}},"Mauvaise isolation",null,"Isolation moyenne",null,"Mauvaise isolation","Isolation moyenne"]
[null,null,null,null,null,"ECS",{"$f":"IF(AND(Chauffage!H20=1,OR('surface auto'!G26=\"Solaire\",G27=\"Solaire\")),SOLAIRE!H25,IF(AND(Chauffage!H20=0,OR('surface auto'!H26=\"Solaire\",H27=\"Solaire\")),SOLAIRE!H25,0))","v":0},null,null,null,null,null,null,null,null,"Maison individuelle avant 48","Combles perdu",{"$f":"1.8*0.8","v":1.4400000000000002},"Combles perdu",{"$f":"0.25*0.8","v":0.2},{"$f":"IF(AND(P31=1,O31=\"Combles perdu\"),R32,IF(AND(P31=1,O31=\"Rampant\"),R33,0))","v":{"$error":"#N/A"}},{"$f":"IF(AND(P31=1,O31=\"Combles perdu\"),T32,IF(AND(P31=1,O31=\"Rampant\"),T33,0))","v":{"$error":"#N/A"}}]
[null,null,null,null,null,null,null,null,null,null,null,null,null,null,"Combles perdu",null,"Rampant",0.5,"Rampant",{"$f":"0.25","v":0.25}]
[null,null,null,null,null,null,null,null,null,null,null,null,null,null,"Rampant","Maison individuelle entre 49 et 74","Combles perdu",{"$f":"0.6*0.8","v":0.48},"Combles perdu",0.18,{"$f":"IF(AND(P31=2,O31=\"Combles perdu\"),R34,IF(AND(P31=2,O31=\"Rampant\"),R35,0))","v":{"$error":"#N/A"}},{"$f":"IF(AND(P31=2,Q34=\"Combles perdu\"),T34,IF(AND(P31=2,Q34=\"Rampant\"),T35,0))","v":{"$error":"#N/A"}}]
[null,null,null,null,null,null,null,null,null,null,null,null,null,null,"Sans plancher haut (mitoyen)",null,"Rampant",0.5,"Rampant",0.2]
[null,null,null,null,null,null,null,null,null,null,null,null,null,null,null,"maison individuelle entre 75 et 88","Combles perdu",{"$f":"0.5*0.5","v":0.25},"Combles perdu",0.16,{"$f":"IF(AND(P31=3,O31=\"Combles perdu\"),R36,IF(AND(P31=3,O31=\"Rampant\"),R37,0))","v":{"$error":"#N/A"}},{"$f":"IF(AND(P31=3,Q36=\"Combles perdu\"),T36,IF(AND(P31=3,Q36=\"Rampant\"),T37,0))","v":{"$error":"#N/A"}}]
[null,null,null,null,null,null,null,null,null,null,null,null,null,null,null,null,"Rampant",0.3,"Rampant",0.18]
[null,null,null,null,null,null,null,null,null,null,null,null,null,null,null,"maison individuelle entre 89 et 2005","Combles perdu",{"$f":"0.35*0.8","v":0.27999999999999997},"Combles perdu",0.14000000000000001,{"$f":"IF(AND(P31=4,O31=\"Combles perdu\"),R38,IF(AND(P31=4,O31=\"Rampant\"),R39,0))","v":{"$error":"#N/A"}},{"$f":"IF(AND(P31=4,Q38=\"Combles perdu\"),T38,IF(AND(P31=4,Q38=\"Rampant\"),T39,0))","v":{"$error":"#N/A"}}]
[null,null,null,null,null,null,null,null,null,null,null,null,null,null,null,null,"Rampant",0.3,"Rampant",0.16]
[]
[0]
[]
[]
[null,null,null,null,null,null,null,null,null,null,null,null,null,null,null,null,null,null,null,"Valeur retenue",{"$f":"SUM(U32:U43)","v":{"$error":"#N/A"}},{"$f":"SUM(V32:V43)","v":{"$error":"#N/A"}}]
[]
[null,null,null,null,null,null,null,null,null,null,null,null,null,null,null,null,null,null,null,"Valeur du U de la paroie par typologie de bâtiment",{"$f":"IF(Saisies!E22=\"Mauvaise isolation\",'surface auto'!U44,'surface auto'!V44)","v":{"$error":"#N/A"}}]

{"sheet":"Chauffage","index":8,"n_rows":208,"n_cols":22,"rows_kept":208,"cut":false,"hidden":true,"merged":[[194,0,194,10],[134,13,134,18],[33,15,33,16],[34,12,34,16],[70,12,70,17],[33,13,33,14],[87,0,87,10],[112,0,112,10],[117,1,117,2],[118,1,118,2],[120,1,120,2],[115,0,115,10],[160,0,160,10],[122,1,122,2],[123,1,123,2],[126,5,126,7],[147,0,147,10],[0,0,0,5],[22,0,22,5],[24,1,24,2],[61,0,61,10],[33,5,33,7],[30,1,30,2],[25,1,25,2],[29,1,29,2],[27,1,27,2]]}
["Calcul des besoins de chauffage"]
[null,null,null,null,null,null,null,null,null,null,null,null,"CM =","sse d'inertie","Cm",3,{"$f":"INDEX(P3:P7,P2,1)","v":0},null,null,"ti",{"$f":"((U3*U4)+(U5*U6))/24","v":19.5}]
[null,null,null,null,null,null,null,null,null,null,null,null,{"$f":"IF(Chauffage!H20=0,'surface auto'!AG26,'surface auto'!Y19)","v":{"$error":"#N/A"}},"Très légère","80 / 3,6 x ABât",{"$f":"80/3.6*M4","v":0},null,null,null,"tinor",{"$f":"Calcul!C12","v":20}]
[null,null,null,null,null,null,null,null,null,null,null,null,{"$f":"Saisies!E11","v":0},"Légère","110 / 3,6 x ABât",{"$f":"110/3.6*M4","v":0},null,null,null,"tnor",{"$f":"24-Calcul!N66","v":18}]
["Mois","APPORTS solaires","apports eclairage + hommes","q","tmoy ext","dt","apports pertes","apports tot","n","dju","Qch (kWh)",null,null,"Moyenne","165 / 3,6 x ABât",{"$f":"165/3.6*M4","v":0},null,null,null,"tinuit",{"$f":"Calcul!C12-Calcul!N67","v":18}]
["Janvier",{"$f":"'Apports solaires'!E68","v":{"$error":"#VALUE!"}},{"$f":"(Calcul!$I$14*Calcul!$J$14*6.5*31)/1000++(Calcul!L15/12)","v":0},{"$f":"IF(($O$15*$F6)=0,(B6+C6)/($O$15*($F6+0.0001)),(B6+C6)/($O$15*$F6))","v":{"$error":"#VALUE!"}},{"$f":"INDEX('Liste communes'!AG20:AG29,'Liste communes'!A18,1)","v":{"$error":"#VALUE!"}},{"$f":"IF($U$2-E6<0,0,$U$2-E6)","v":{"$error":"#VALUE!"}},{"$f":"IF(J6>200,Calcul!$L$10/12,0)","v":{"$error":"#VALUE!"}},{"$f":"G6+B6+C6","v":{"$error":"#VALUE!"}},{"$f":"(1-D6^$O$14)/(1-D6^($O$14+1))","v":{"$error":"#VALUE!"}},{"$f":"INDEX('Liste communes'!F20:F29,'Liste communes'!A18,1)","v":{"$error":"#VALUE!"}},{"$f":"IF(((F6*J6*$O$15)/1000)-I6*H6>0,((F6*J6*$O$15)/1000)-I6*H6,0)","v":{"$error":"#VALUE!"}},{"$f":"F6*J6*$O$15/1000","v":{"$error":"#VALUE!"}},null,"Lourde","260 / 3,6 x ABât",{"$f":"260/3.6*M4","v":0},null,{"$f":"IF(J6>200,31,0)","v":{"$error":"#VALUE!"}},null,"tnuit",{"$f":"Calcul!N66","v":6},6]
["Février",{"$f":"'Apports solaires'!M68","v":{"$error":"#VALUE!"}},{"$f":"(Calcul!$I$14*Calcul!$J$14*6.5*28)/1000+(Calcul!L15/12)","v":0},{"$f":"IF(($O$15*$F7)=0,(B7+C7)/($O$15*($F7+0.0001)),(B7+C7)/($O$15*$F7))","v":{"$error":"#VALUE!"}},{"$f":"INDEX('Liste communes'!AH20:AH29,'Liste communes'!A18,1)","v":{"$error":"#VALUE!"}},{"$error":"#VALUE!"},{"$f":"IF(J7>200,Calcul!$L$10/12,0)","v":{"$error":"#VALUE!"}},{"$f":"G7+B7+C7","v":{"$error":"#VALUE!"}},{"$f":"(1-D7^$O$14)/(1-D7^($O$14+1))","v":{"$error":"#VALUE!"}},{"$f":"INDEX('Liste communes'!G20:G29,'Liste communes'!A18,1)","v":{"$error":"#VALUE!"}},{"$f":"IF(((F7*J7*$O$15)/1000)-I7*H7>0,((F7*J7*$O$15)/1000)-I7*H7,0)","v":{"$error":"#VALUE!"}},{"$error":"#VALUE!"},null,"Très lourde","370 / 3,6 x ABât",{"$f":"370/3.6*M4","v":0},null,{"$f":"IF(J7>200,28,0)","v":{"$error":"#VALUE!"}}]
["Mars",{"$f":"'Apports solaires'!U68","v":{"$error":"#VALUE!"}},{"$f":"(Calcul!$I$14*Calcul!$J$14*6*31)/1000+(Calcul!L15/12)","v":0},{"$error":"#VALUE!"},{"$f":"INDEX('Liste communes'!AI20:AI29,'Liste communes'!A18,1)","v":{"$error":"#VALUE!"}},{"$error":"#VALUE!"},{"$f":"IF(J8>200,Calcul!$L$10/12,0)","v":{"$error":"#VALUE!"}},{"$error":"#VALUE!"},{"$error":"#VALUE!"},{"$f":"INDEX('Liste communes'!H20:H29,'Liste communes'!A18,1)","v":{"$error":"#VALUE!"}},{"$error":"#VALUE!"},{"$error":"#VALUE!"},null,null,null,null,null,{"$f":"IF(J8>200,31,0)","v":{"$error":"#VALUE!"}}]
["Avril",{"$f":"'Apports solaires'!AC68","v":{"$error":"#VALUE!"}},{"$f":"(Calcul!$I$14*Calcul!$J$14*5*30)/1000+(Calcul!L15/12)","v":0},{"$error":"#VALUE!"},{"$f":"INDEX('Liste communes'!AJ20:AJ29,'Liste communes'!A18,1)","v":{"$error":"#VALUE!"}},{"$error":"#VALUE!"},{"$f":"IF(J9>200,Calcul!$L$10/12,0)","v":{"$error":"#VALUE!"}},{"$error":"#VALUE!"},{"$error":"#VALUE!"},{"$f":"INDEX('Liste communes'!I20:I29,'Liste communes'!A18,1)","v":{"$error":"#VALUE!"}},{"$f":"IF(((F9*J9*$O$15)/1000)-I9*H9>0,((F9*J9*$O$15)/1000)-I9*H9,0)","v":{"$error":"#VALUE!"}},{"$error":"#VALUE!"},"QG",null,null,null,null,{"$f":"IF(J9>200,30,0)","v":{"$error":"#VALUE!"}}]
["Mai",{"$f":"'Apports solaires'!BI68","v":{"$error":"#VALUE!"}},{"$f":"(Calcul!$I$14*Calcul!$J$14*4*31)/1000+(Calcul!L15/12)","v":0},{"$error":"#VALUE!"},{"$f":"INDEX('Liste communes'!AK20:AK29,'Liste communes'!A18,1)","v":{"$error":"#VALUE!"}},{"$error":"#VALUE!"},{"$f":"IF(J10>200,Calcul!$L$10/12,0)","v":{"$error":"#VALUE!"}},{"$error":"#VALUE!"},{"$error":"#VALUE!"},{"$f":"INDEX('Liste communes'!J20:J29,'Liste communes'!A18,1)","v":{"$error":"#VALUE!"}},{"$error":"#VALUE!"},{"$f":"F10*J10*$O$15/1000","v":{"$error":"#VALUE!"}},"q","apportswh/(H*dt)",null,null,null,{"$f":"IF(J10>200,31,0)","v":{"$error":"#VALUE!"}}]
["Juin",{"$f":"'Apports solaires'!BQ68","v":{"$error":"#VALUE!"}},{"$f":"(Calcul!$I$14*Calcul!$J$14*4*30)/1000+(Calcul!L15/12)","v":0},{"$error":"#VALUE!"},{"$f":"INDEX('Liste communes'!AL20:AL29,'Liste communes'!A18,1)","v":{"$error":"#VALUE!"}},{"$error":"#VALUE!"},{"$f":"IF(J11>200,Calcul!$L$10/12,0)","v":{"$error":"#VALUE!"}},{"$error":"#VALUE!"},{"$error":"#VALUE!"},{"$f":"INDEX('Liste communes'!K20:K29,'Liste communes'!A18,1)","v":{"$error":"#VALUE!"}},{"$error":"#VALUE!"},{"$error":"#VALUE!"},"si q<>1 n =","n = (1 - qa) / (1 - qa+1)",null,null,null,{"$f":"IF(J11>200,30,0)","v":{"$error":"#VALUE!"}}]
["Juillet",{"$f":"'Apports solaires'!BY68","v":{"$error":"#VALUE!"}},{"$f":"(Calcul!$I$14*Calcul!$J$14*3*31)/1000+(Calcul!L15/12)","v":0},{"$error":"#VALUE!"},{"$f":"INDEX('Liste communes'!AM20:AM29,'Liste communes'!A18,1)","v":{"$error":"#VALUE!"}},{"$error":"#VALUE!"},{"$f":"IF(J12>200,Calcul!$L$10/12,0)","v":{"$error":"#VALUE!"}},{"$error":"#VALUE!"},{"$error":"#VALUE!"},{"$f":"INDEX('Liste communes'!L20:L29,'Liste communes'!A18,1)","v":{"$error":"#VALUE!"}},{"$error":"#VALUE!"},{"$error":"#VALUE!"},"si q=1 n =","a/(a+1)",null,null,null,{"$f":"IF(J12>200,31,0)","v":{"$error":"#VALUE!"}}]
["Août",{"$f":"'Apports solaires'!CG68","v":{"$error":"#VALUE!"}},{"$f":"(Calcul!$I$14*Calcul!$J$14*4*31)/1000+(Calcul!L15/12)","v":0},{"$error":"#VALUE!"},{"$f":"INDEX('Liste communes'!AN20:AN29,'Liste communes'!A18,1)","v":{"$error":"#VALUE!"}},{"$error":"#VALUE!"},{"$f":"IF(J13>200,Calcul!$L$10/12,0)","v":{"$error":"#VALUE!"}},{"$error":"#VALUE!"},{"$error":"#VALUE!"},{"$f":"INDEX('Liste communes'!M20:M29,'Liste communes'!A18,1)","v":{"$error":"#VALUE!"}},{"$error":"#VALUE!"},{"$error":"#VALUE!"},"t=cm/h",null,{"$f":"Q2/O15","v":{"$error":"#VALUE!"}},null,null,{"$f":"IF(J13>200,31,0)","v":{"$error":"#VALUE!"}}]
["Septembre",{"$f":"'Apports solaires'!CO68","v":{"$error":"#VALUE!"}},{"$f":"(Calcul!$I$14*Calcul!$J$14*4*30)/1000+(Calcul!L15/12)","v":0},{"$error":"#VALUE!"},{"$f":"INDEX('Liste communes'!AO20:AO29,'Liste communes'!A18,1)","v":{"$error":"#VALUE!"}},{"$error":"#VALUE!"},{"$f":"IF(J14>200,Calcul!$L$10/12,0)","v":{"$error":"#VALUE!"}},{"$error":"#VALUE!"},{"$error":"#VALUE!"},{"$f":"INDEX('Liste communes'!N20:N29,'Liste communes'!A18,1)","v":{"$error":"#VALUE!"}},{"$error":"#VALUE!"},{"$error":"#VALUE!"},"a=",null,{"$f":"1+O13/16","v":{"$error":"#VALUE!"}},null,null,{"$f":"IF(J14>200,30,0)","v":{"$error":"#VALUE!"}}]
["Octobre",{"$f":"'Apports solaires'!AK68","v":{"$error":"#VALUE!"}},{"$f":"(Calcul!$I$14*Calcul!$J$14*5*31)/1000+(Calcul!L15/12)","v":0},{"$error":"#VALUE!"},{"$f":"INDEX('Liste communes'!AP20:AP29,'Liste communes'!A18,1)","v":{"$error":"#VALUE!"}},{"$error":"#VALUE!"},{"$f":"IF(J15>200,Calcul!$L$10/12,0)","v":{"$error":"#VALUE!"}},{"$error":"#VALUE!"},{"$error":"#VALUE!"},{"$f":"INDEX('Liste communes'!O20:O29,'Liste communes'!A18,1)","v":{"$error":"#VALUE!"}},{"$error":"#VALUE!"},{"$error":"#VALUE!"},"H",null,{"$f":"Calcul!V13+Calcul!V14","v":{"$error":"#VALUE!"}},null,null,{"$f":"IF(J15>200,31,0)","v":{"$error":"#VALUE!"}}]
["Novembre",{"$f":"'Apports solaires'!AS68","v":{"$error":"#VALUE!"}},{"$f":"(Calcul!$I$14*Calcul!$J$14*6*30)/1000+(Calcul!L15/12)","v":0},{"$error":"#VALUE!"},{"$f":"INDEX('Liste communes'!AQ20:AQ29,'Liste communes'!A18,1)","v":{"$error":"#VALUE!"}},{"$error":"#VALUE!"},{"$f":"IF(J16>200,Calcul!$L$10/12,0)","v":{"$error":"#VALUE!"}},{"$error":"#VALUE!"},{"$error":"#VALUE!"},{"$f":"INDEX('Liste communes'!P20:P29,'Liste communes'!A18,1)","v":{"$error":"#VALUE!"}},{"$error":"#VALUE!"},{"$error":"#VALUE!"},null,null,null,null,null,{"$f":"IF(J16>200,30,0)","v":{"$error":"#VALUE!"}}]
["Décembre",{"$f":"'Apports solaires'!BA68","v":{"$error":"#VALUE!"}},{"$f":"(Calcul!$I$14*Calcul!$J$14*6.5*31)/1000+(Calcul!L15/12)","v":0},{"$error":"#VALUE!"},{"$f":"INDEX('Liste communes'!AR20:AR29,'Liste communes'!A18,1)","v":{"$error":"#VALUE!"}},{"$error":"#VALUE!"},{"$f":"IF(J17>200,Calcul!$L$10/12,0)","v":{"$error":"#VALUE!"}},{"$error":"#VALUE!"},{"$error":"#VALUE!"},{"$f":"INDEX('Liste communes'!Q20:Q29,'Liste communes'!A18,1)","v":{"$error":"#VALUE!"}},{"$error":"#VALUE!"},{"$error":"#VALUE!"},null,null,null,null,null,{"$f":"IF(J17>200,31,0)","v":{"$error":"#VALUE!"}}]
["Besoin annuel en chauffage annuel (kWh/an)",{"$f":"SUM(B6:B17)","v":{"$error":"#VALUE!"}},{"$f":"SUM(C6:C17)","v":0},null,null,null,null,null,null,null,{"$f":"SUM(K6:K17)","v":{"$error":"#VALUE!"}},null,null,null,null,null,null,{"$f":"SUM(R5:R17)","v":{"$error":"#VALUE!"}}]
["Besoin annuel en chauffage (kWh/m²/an)",null,null,null,null,null,null,null,null,null,{"$f":"K18/Calcul!C8","v":{"$error":"#VALUE!"}}]
["conso chauffage",null,null,null,null,null,{"$f":"IF(H20=1,\"Saisie simple\",\"Saisie intermédiare\")","v":"Saisie intermédiare"},0,{"$f":"IF(H20=1,\"simple\",IF(H20=0,\"intermédiaire\",\"\"))","v":"intermédiaire"}]
["conso chauffage (kWh/an) (kWh/m²/an)"]
[]
["Installation de chauffage"]
[null,null,null,null,null,null,null,null,"Solaire"]
["Chauffage",{"$f":"INDEX(H36:H37,H35,1)","v":{"$error":"#VALUE!"}},null,null,null,"Régulation",null,null,1]
["Type d'emetteurs",{"$f":"INDEX(A36:B39,B35,1)","v":{"$error":"#VALUE!"}},null,null,null,"Sans vanne thermo ou sans régulation",90,null,"OUI"]
["Rendement",{"$f":"INDEX(A36:B39,B35,2)","v":{"$error":"#VALUE!"}},"%",null,null,"Régulation + plancher chauffant, ou Emetteur ne permettant pas un arrêt total de l'émission",93,null,"NON"]
["Tuyauteries de distribution",{"$f":"IF(H35=1,INDEX(A43:C46,D42,1),IF(H35=2,INDEX(A43:C45,D42,2)))","v":false},null,null,null,"Régulateur ou vanne thermo + radiateurs, Emetteur permettant un arrêt total de l'émission",96]
["Rendement",{"$f":"IF(B25=H36,INDEX(A43:C46,D42,2),IF(B25=H37,INDEX(A43:C45,D42,3,0)))","v":{"$error":"#VALUE!"}},"%",null,null,"Radiateur électrique + thermostat",98]
[]
["Type de générateur",{"$f":"INDEX(H42:H51,H41,1)","v":{"$error":"#VALUE!"}}]
["Rendement",{"$f":"IF(E42=1,INDEX(H42:I51,H41,2),IF(E42=2,INDEX(H42:J51,H41,3),IF(E42=3,INDEX(H42:K51,H41,4))))","v":false},"%"]
[]
[null,{"$f":"IF(Saisies!E17<4,1,IF(Saisies!E17<6,2,IF(Saisies!E17<8,3,4)))","v":1},null,null,null,"Chauffage",null,null,null,null,null,null,null,"INDIV",null,"COLL",null,"retenu"]
["Type d'emetteurs",null,"<4m","entre 4 et 6m","entre 6 et 8m","plus de 8m",null,null,null,null,null,null,"consos aux génération/distribution"]
["Radiateurs",90,0.2,0.8,1.2,1.6,null,"Chauffage individuel",null,null,null,null,"Chauffage électrique",0,{"$f":"(((N36/1000)*Saisies!$E$10)*24)*Chauffage!$R$18","v":{"$error":"#VALUE!"}},{"$f":"+N36","v":0},{"$f":"(P36/1000)*24*Chauffage!$R$18","v":{"$error":"#VALUE!"}},{"$f":"IF($H$35=1,O36,Q36)","v":{"$error":"#VALUE!"}}]
["Rayonnants",97,0.2,0.8,1.2,1.6,null,"Chauffage collectif",null,null,null,null,"Chaud. à condensation",{"$f":"0.7*(Calcul!$C$8/Saisies!$E$10)","v":{"$error":"#DIV/0!"}},{"$f":"(((N37/1000)*Saisies!$E$10)*24)*Chauffage!$R$18","v":{"$error":"#DIV/0!"}},{"$f":"0.6*Saisies!$E$11","v":0},{"$f":"(P37/1000)*24*Chauffage!$R$18","v":{"$error":"#VALUE!"}},{"$f":"IF($H$35=1,O37,Q37)","v":{"$error":"#VALUE!"}}]
["Electriques",80,0.2,0.8,1.2,1.6,null,null,null,null,null,null,"Chaud. à haut rendement",{"$f":"0.8*(Calcul!$C$8/Saisies!$E$10)","v":{"$error":"#DIV/0!"}},{"$f":"(((N38/1000)*Saisies!$E$10)*24)*Chauffage!$R$18","v":{"$error":"#DIV/0!"}},{"$f":"0.7*Saisies!$E$11","v":0},{"$f":"(P38/1000)*24*Chauffage!$R$18","v":{"$error":"#VALUE!"}},{"$error":"#VALUE!"}]
["plancher",99,0,0,0,0,null,null,null,null,null,null,"Chaud. Classique",{"$f":"0.9*(Calcul!$C$8/Saisies!$E$10)","v":{"$error":"#DIV/0!"}},{"$f":"(((N39/1000)*Saisies!$E$10)*24)*Chauffage!$R$18","v":{"$error":"#DIV/0!"}},{"$f":"0.8*Saisies!$E$11","v":0},{"$f":"(P39/1000)*24*Chauffage!$R$18","v":{"$error":"#VALUE!"}},{"$error":"#VALUE!"}]
["Autres",100,0.4,1.2,2,2.8,null,null,null,null,null,null,"Poêle buches",0,{"$f":"(N40/1000)*24*Chauffage!$R$18*Saisies!$E$10","v":{"$error":"#VALUE!"}},0,{"$f":"(P40/1000)*24*Chauffage!$R$18","v":{"$error":"#VALUE!"}},{"$error":"#VALUE!"}]
[null,null,null,null,null,null,null,null,"récente (depuis 91)","de 80 à 90","très ancienne  ( avant 1980)",null,"Pompe à chaleur air/air ou air/eau",{"$f":"1*Calcul!$C$8/Saisies!$E$10","v":{"$error":"#DIV/0!"}},{"$f":"(N41/1000)*24*Chauffage!$R$18*Saisies!$E$10","v":{"$error":"#DIV/0!"}},{"$f":"1*Saisies!$E$11","v":0},{"$f":"(P41/1000)*24*Chauffage!$R$18","v":{"$error":"#VALUE!"}},{"$error":"#VALUE!"}]
["Tuyauteries de distribution","Chauffage individuel","Chauffage collectif",null,null,"récente (-10 ans)",null,"Chauffage électrique",98,90,80,null,"Pompe à chaleur eau/eau",{"$f":"2*Calcul!$C$8/Saisies!$E$10","v":{"$error":"#DIV/0!"}},{"$f":"(N42/1000)*24*Chauffage!$R$18*Saisies!$E$10","v":{"$error":"#DIV/0!"}},{"$f":"1.5*Saisies!$E$11","v":0},{"$f":"(P42/1000)*24*Chauffage!$R$18","v":{"$error":"#VALUE!"}},{"$error":"#VALUE!"}]
["Tuyaux non calorifugées",90,95,null,null,"ancienne (10 à 20 ans)",null,"Chaud. à condensation",95,90,80,null,"Pompe à chaleur géothermale",{"$f":"3*Calcul!$C$8/Saisies!$E$10","v":{"$error":"#DIV/0!"}},{"$f":"(N43/1000)*24*Chauffage!$R$18*Saisies!$E$10","v":{"$error":"#DIV/0!"}},{"$f":"2*Saisies!$E$11","v":0},{"$f":"(P43/1000)*24*Chauffage!$R$18","v":{"$error":"#VALUE!"}},{"$error":"#VALUE!"}]
["Tuyaux mal calorifugées",94,97,null,null,"très ancienne  ( + de 20 ans)",null,"Chaud. à haut rendement",90,90,85,null,"Insert bois",0,{"$f":"(N44/1000)*24*Chauffage!$R$18*Saisies!$E$10","v":{"$error":"#VALUE!"}},{"$f":"+N44","v":0},{"$f":"(P44/1000)*24*Chauffage!$R$18","v":{"$error":"#VALUE!"}},{"$error":"#VALUE!"}]
["Tuyaux bien calorifugées",96,98,null,null,null,null,"Chaud. Classique",85,75,70,null,"Poêle granulés",75,{"$f":"(N45/1000)*24*Chauffage!$R$18*Saisies!$E$10","v":{"$error":"#VALUE!"}},0,0,0]
["Entièrement en volume ch",100,100,null,null,null,null,"Poêle buches",87,80,{"$f":"Chauffage!160:160+Chauffage!194:194","v":0}]
[null,null,null,null,null,null,null,"Pompe à chaleur air/air ou air/eau",300,0,0]
[null,null,null,null,null,null,null,"Pompe à chaleur eau/eau",350,0,0]
[null,null,null,null,null,null,null,"Pompe à chaleur géothermale",350,0,0]
[null,null,null,null,null,null,null,"Insert bois",80,72,65]
[null,null,null,null,null,null,null,"Poêle granulés",85,80,75]
[null,null,null,null,null,null,{"$f":"INDEX(H42:I51,H41,2)","v":{"$error":"#VALUE!"}}]
[]
[]
[]
[]
[]
[]
[]
[]
[]
["Appoint chauffage"]
[]
["Type d'emetteurs",null,"<4m","entre 4 et 6m","entre 6 et 8m","plus de 8m"]
["Radiateurs",90,0.2,0.8,1.2,1.6]
["Rayonnants",97,0.2,0.8,1.2,1.6]
["convecteurs",98,0.2,0.8,1.2,1.6]
["plancher",99,0,0,0,0]
["Autres",100,0.4,1.2,2,2.8]
[null,null,null,null,null,null,null,null,"récente (depuis 91)","de 80 à 90","très ancienne  ( avant 1980)",null,null,"INDIV",null,"COLL",null,"retenu"]
["Tuyauteries de distribution","Chauffage individuel","Chauffage collectif",null,"Régulation",4,null,"Chauffage électrique",98,90,80,null,"consos aux génération/distribution"]
["Réseau sans perte ou inexistant",100,100,null,"Sans vanne thermo ou sans régulation",2.5,null,"Chaud. à condensation",95,90,80,null,"Chauffage électrique",{"$f":"N36","v":0},{"$error":"#VALUE!"},0,{"$error":"#VALUE!"},{"$f":"IF($H$35=1,O72,Q72)","v":{"$error":"#VALUE!"}}]
[" Tuyaux non calorifugées",90,95,null,"Régulation + plancher chauffant, ou Emetteur ne permettant pas un arrêt total de l'émission",2,90,"Chaud. à haut rendement",90,90,85,null,"Chaud. à condensation",{"$error":"#DIV/0!"},{"$error":"#DIV/0!"},0,{"$error":"#VALUE!"},{"$f":"IF($H$35=1,O73,Q73)","v":{"$error":"#VALUE!"}}]
["Tuyaux mal calorifugées",94,97,null,"Régulateur ou vanne thermo + radiateurs, Emetteur permettant un arrêt total de l'émission",1.8,92,"Chaud. Classique",85,75,70,null,"Chaud. à haut rendement",{"$error":"#DIV/0!"},{"$error":"#DIV/0!"},0,{"$error":"#VALUE!"},{"$error":"#VALUE!"}]
["Tuyaux bien calorifugées",96,98,null,"Radiateur électrique + thermostat",0.9,98,"Insert bois",80,72,65,null,"Chaud. Classique",{"$error":"#DIV/0!"},{"$error":"#DIV/0!"},0,{"$error":"#VALUE!"},{"$error":"#VALUE!"}]
[null,null,null,null,null,null,null,"Pompe à chaleur air/air ou eau",300,0,0,null,"Poêle buches",0,{"$error":"#VALUE!"},0,{"$error":"#VALUE!"},{"$error":"#VALUE!"}]
[1,null,"Electricité",null,null,"récente (-10 ans)",null,"Pompe à chaleur eau/air ou eau",350,0,0,null,"Pompe à chaleur air/air ou air/eau",{"$error":"#DIV/0!"},{"$error":"#DIV/0!"},0,{"$error":"#VALUE!"},{"$error":"#VALUE!"}]
[null,null,"Fioul domestique",null,null,"ancienne (10 à 20 ans)",null,"Pompe à chaleur géothermale",350,0,0,null,"Pompe à chaleur eau/eau",{"$error":"#DIV/0!"},{"$error":"#DIV/0!"},0,{"$error":"#VALUE!"},{"$error":"#VALUE!"}]
[null,null,"Gaz naturel",null,null,"très ancienne  ( + de 20 ans)",null,"sans appoint",0,0,0,null,"Pompe à chaleur géothermale",{"$error":"#DIV/0!"},{"$error":"#DIV/0!"},0,{"$error":"#VALUE!"},{"$error":"#VALUE!"}]
[null,null,"Gaz propane",null,null,null,null,"Capteurs solaires",100,100,100,null,"sans appoint",0,{"$f":"(N80/1000)*24*Chauffage!$R$18*Saisies!$E$10","v":{"$error":"#VALUE!"}},{"$f":"+N80","v":0},{"$f":"(P80/1000)*24*Chauffage!$R$18","v":{"$error":"#VALUE!"}},{"$error":"#VALUE!"}]
[null,null,"Bois bûches",null,null,null,null,{"$f":"INDEX(H71:I80,H70,2)","v":{"$error":"#VALUE!"}},null,null,null,null,"Capteurs solaires",{"$f":"(2*Saisies!E11)/Saisies!E10","v":{"$error":"#DIV/0!"}},{"$f":"(((N81/1000)*Saisies!$E$10)*24)*Chauffage!$R$18","v":{"$error":"#DIV/0!"}},{"$f":"0.3*Calcul!$C$8","v":0},{"$f":"(P81/1000)*24*Chauffage!$R$18","v":{"$error":"#VALUE!"}},{"$error":"#VALUE!"}]
[null,null,"Granulé bois"]
[null,null,"Plaquette bois",null,null,null,null,"Rendement saisie inter appoint",{"$f":"INDEX(I71:K80,H70,E77)","v":{"$error":"#VALUE!"}}]
[]
[]
[]
[]
["Energie ECS"]
[]
[]
[null,"récente (depuis 91)","de 80 à 90","très ancienne  ( avant 1980)",null,"récente (-10 ans)",{"$f":"IF($E$91=1,INDEX(B92:B97,A91,1),IF($E$91=2,INDEX(C92:C97,A91,1),INDEX(D92:D97,A91,1)))","v":{"$error":"#VALUE!"}}]
["Ballon avec résistance électrique",100,95,85,null,"ancienne (10 à 20 ans)","Electricité"]
["Ballon Raccordé au système de chauffage",90,81,{"$f":"B93*0.85","v":76.5},null,"très ancienne  ( + de 20 ans)",{"$f":"INDEX('Tarif combustible'!B3:B11,'Tarif combustible'!C17)","v":{"$error":"#VALUE!"}}]
["Ballon thermodynamique",{"$f":"100*2.2","v":220.00000000000003},0,0,null,null,"Electricité"]
["Ballon solaire lié au chauffage",90,{"$f":"B95*0.9","v":81},{"$f":"B95*0.85","v":76.5},1,null,{"$f":"G93","v":{"$error":"#VALUE!"}}]
["Ballon solaire avec appoint électrique",100,95,85,1,null,{"$f":"G92","v":"Electricité"}]
["Chauffe bain gaz",85,75,65,null,null,"Gaz propane"]
[]
[]
[]
[]
[]
[]
[]
[]
[]
[null,null,null,null,null,null,null,{"$f":"INDEX(A92:B99,A91,2)","v":{"$error":"#VALUE!"}}]
[]
[]
[]
[]
[]
["Systèmes de chauffage + appoint + ECS Saisie Simplifiée"]
[]
[]
["Installation de chauffage"]
[null,null,null,null,null,null,null,null,"Solaire"]
["Chauffage","Chauffage individuel",null,null,null,"Régulation",2,null,1]
["Type d'emetteurs",{"$f":"INDEX(A129:B132,B128,1)","v":{"$error":"#VALUE!"}},null,null,null,"Sans vanne thermo ou sans régulation",90,null,"OUI"]
["Rendement",{"$f":"INDEX(A129:B133,B128,2)","v":{"$error":"#VALUE!"}},"%",null,null,"Régulation + plancher chauffant, ou Emetteur ne permettant pas un arrêt total de l'émission",93,null,"NON"]
[null,null,null,null,null,"Régulateur ou vanne thermo + radiateurs, Emetteur permettant un arrêt total de l'émission",96]
[null,null,null,null,null,"Radiateur électrique + thermostat",98]
[]
["Type de générateur",{"$f":"INDEX(H135:H143,H134,1)","v":{"$error":"#VALUE!"}}]
["Rendement",{"$f":"IF(E135=1,INDEX(H135:I143,H134,2),IF(E135=2,INDEX(H135:J143,H134,3),IF(E135=3,INDEX(H135:K143,H134,4))))","v":false},"%"]
[]
[null,{"$f":"IF(Saisies!E110<4,1,IF(Saisies!E110<6,2,IF(Saisies!E110<8,3,4)))","v":1},null,null,null,"Chauffage"]
["Type d'emetteurs"]
["Radiateurs",90]
["Rayonnants",97]
["Electriques",80]
["plancher",99]
["Autres",100]
[null,null,null,null,null,null,null,null,"récente (depuis 91)","de 80 à 90","très ancienne  ( avant 1980)",null,null,null,"INDIV",null,"COLL",null,"retenu"]
[null,"Tuyauteries de distribution","Chauffage individuel",null,null,"récente (-10 ans)","Electricité","Chauffage électrique",100,100,100,null,null,"consos aux génération/distribution"]
[null," Tuyaux non calorifugés",90,null,null,"ancienne (10 à 20 ans)","Gaz naturel","Chaud. à condensation",102,90,85,null,1,"Chauffage électrique",0,{"$f":"(O136/1000)*24*Chauffage!$R$18*Saisies!$E$10","v":{"$error":"#VALUE!"}},null,null,{"$f":"IF($H$35=1,P136,R136)","v":0},"Chauffage électrique"]
[null,"Tuyaux calorifugés",96,null,null,"très ancienne  ( + de 20 ans)","Gaz naturel","Chaud. à haut rendement",95,90,85,null,null,"Chaud. à condensation",{"$f":"N73","v":{"$error":"#DIV/0!"}},{"$error":"#DIV/0!"},null,null,{"$f":"IF($M$136=1,P137,R137)","v":{"$error":"#DIV/0!"}},"Chaud. à condensation"]
[null,"Tuyaux en volume chauffé",100,null,null,null,"Gaz propane","Chaud. Classique",85,75,70,null,null,"Chaud. à haut rendement",{"$error":"#DIV/0!"},{"$error":"#DIV/0!"},null,null,{"$f":"IF($M$136=1,P138,R138)","v":{"$error":"#DIV/0!"}},"Chaud. à haut rendement"]
[null,null,null,null,null,null,"Bois bûches","Poêle/insert bûches",80,70,60,null,null,"Chaud. Classique",{"$error":"#DIV/0!"},{"$error":"#DIV/0!"},null,null,{"$f":"IF($M$136=1,P139,R139)","v":{"$error":"#DIV/0!"}},"Chaud. Classique"]
[null,null,null,null,null,null,"Granulé bois","poêle/ insert granulés",85,80,75,null,null,"Poêle buches",0,{"$f":"(O140/1000)*24*Chauffage!$R$18*Saisies!$E$10","v":{"$error":"#VALUE!"}},null,null,{"$f":"IF($M$136=1,P140,R140)","v":{"$error":"#VALUE!"}},"Poêle/insert bûches"]
[null,null,null,null,null,null,"Electricité","Pompe à chaleur air/air ou eau",300,0,0,null,null,"poêle/ insert granulés",{"$f":"N45","v":75},{"$f":"O45","v":{"$error":"#VALUE!"}},null,null,{"$f":"IF($M$136=1,P142,R141)","v":{"$error":"#DIV/0!"}},"poêle/ insert granulés"]
[null,null,null,null,null,null,"Electricité","Pompe à chaleur eau/air ou eau",350,0,0,null,null,"Pompe à chaleur air/air ou air/eau",{"$f":"N77","v":{"$error":"#DIV/0!"}},{"$error":"#DIV/0!"},null,null,{"$f":"IF($M$136=1,P143,R142)","v":{"$error":"#DIV/0!"}},"Pompe à chaleur air/air ou eau"]
[null,null,null,null,null,null,"Electricité","Pompe à chaleur géothermale",350,0,0,null,null,"Pompe à chaleur eau/eau",{"$error":"#DIV/0!"},{"$error":"#DIV/0!"},null,null,{"$f":"IF($M$136=1,P144,R143)","v":{"$error":"#DIV/0!"}},"Pompe à chaleur eau/air ou eau"]
[null,null,null,null,null,null,null,null,null,null,null,null,null,"Pompe à chaleur géothermale",{"$error":"#DIV/0!"},{"$error":"#DIV/0!"},null,null,{"$f":"IF($M$136=1,P145,R144)","v":0},"Pompe à chaleur géothermale"]
[]
[]
[]
["Appoint chauffage"]
[]
[]
["Type d'énergie sélectionnée",{"$f":"IF(G151=1,\"Electricité\",IF(G151=2,\"Gaz propane\",IF(G151=3,\"Fioul domestique\",IF(G151=4,\"Bois bûches\",IF(G151=5,\"Granulé bois\",IF(G151=6,\"Capteurs solaires\",\"sans appoint\"))))))","v":"sans appoint"},null,null,"récente (-10 ans)",null,null,"récente (depuis 91)","de 80 à 90","très ancienne  ( avant 1980)",null,null,1,"Chauffage électrique",0,{"$f":"(O151/1000)*24*Chauffage!$R$18*Saisies!$E$10","v":{"$error":"#VALUE!"}},null,null,{"$f":"IF($H$35=1,P151,R151)","v":0}]
[null,null,null,null,"ancienne (10 à 20 ans)","Electricité","Chauffage électrique",null,72,null,null,null,null,"Chaudière gaz",{"$f":"O138","v":{"$error":"#DIV/0!"}},{"$f":"(O152/1000)*24*Chauffage!$R$18*Saisies!$E$10","v":{"$error":"#DIV/0!"}},null,null,{"$f":"IF($M$136=1,P152,R152)","v":{"$error":"#DIV/0!"}}]
[null,null,null,null,"très ancienne  ( + de 20 ans)","Gaz naturel","Chaudière gaz",null,65,null,null,null,null,"Chaudière fioul",{"$f":"O139","v":{"$error":"#DIV/0!"}},{"$f":"(O153/1000)*24*Chauffage!$R$18*Saisies!$E$10","v":{"$error":"#DIV/0!"}},null,null,{"$error":"#DIV/0!"}]
[null,null,null,null,null,"Fioul domestique","Chaudière fioul",null,64,null,null,null,null,"Insert ou poêle à granulés",{"$f":"O140","v":0},{"$f":"(O154/1000)*24*Chauffage!$R$18*Saisies!$E$10","v":{"$error":"#VALUE!"}},null,null,{"$error":"#VALUE!"}]
["Rendement appoint simplifié",{"$f":"INDEX(I152:I158,G151,1)","v":74},null,null,null,"Granulé bois","appoint bois granulés",null,74,null,null,null,null,"Appoint bois bûches",0,{"$f":"(O155/1000)*24*Chauffage!$R$18*Saisies!$E$10","v":{"$error":"#VALUE!"}},null,null,{"$error":"#VALUE!"}]
[null,null,null,null,null,"Bois bûches","Appoint bois bûches",null,60,null,null,null,null,"Capteurs solaires",{"$f":"N81","v":{"$error":"#DIV/0!"}},{"$f":"O81","v":{"$error":"#DIV/0!"}},null,null,{"$error":"#DIV/0!"}]
[null,null,null,null,null,"Solaire","Capteurs solaires",null,100,null,null,null,null,"Sans appoint",0,{"$f":"(O157/1000)*24*Chauffage!$R$18*Saisies!$E$10","v":{"$error":"#VALUE!"}},null,null,{"$error":"#VALUE!"}]
[null,null,null,null,null,"Sans appoint","Sans appoint",null,0]
[]
[]
["Energie ECS"]
[]
[]
[null,"récente (depuis 91)","de 80 à 90","très ancienne  ( avant 1980)",null,null,"récente (-10 ans)",null,{"$f":"IF(F164=1,INDEX(B165:B170,A164,1),IF(F164=2,INDEX(C165:C170,A164,1),INDEX(D165:D170,A164,1)))","v":{"$error":"#VALUE!"}}]
["Ballon avec résistance électrique",100,95,85,"Electricité",null,"ancienne (10 à 20 ans)"]
["Ballon Raccordé au système de chauffage",90,81,{"$f":"B166*0.85","v":76.5},{"$f":"INDEX(G135:G143,H134)","v":{"$error":"#VALUE!"}},null,"très ancienne  ( + de 20 ans)"]
["Ballon thermodynamique",{"$f":"100*2.2","v":220.00000000000003},0,0,"Electricité"]
["Ballon solaire lié au chauffage",90,{"$f":"B168*0.9","v":81},{"$f":"B168*0.85","v":76.5},{"$f":"E166","v":{"$error":"#VALUE!"}}]
["Ballon solaire avec appoint électrique",100,95,85,{"$f":"E165","v":"Electricité"}]
["Chauffe bain gaz",85,75,65,"Gaz propane"]
[]
[]
[]
[]
[]
["Tau"]
["Pièce",0,"Sous-sol",null,"Espace sous toiture",null,"Vide sanitaire",0.8]
["avec seulement 1 mur extérieur",0.4,"sans fenêtres ni portes extérieures",0.5,"espace sous toiture fortement ventilé (par exemple : couvertures en tuiles ou autres matériaux formant couverture discontinue) sans feutres ou panneaux en sous-face",1]
["avec au moins 2 murs extérieurs sans portes extérieures",0.5,"avec fenêtres ou portes extérieures",0.8,"autre toiture non isolée",0.9]
["avec au moins 2 murs extérieurs et des portes extérieures (par exemple : entrées, garages)",0.6,null,null,"toiture isolée",0.7]
["avec au moins 3 murs extérieurs (par exemple : escalier extérieur)",0.8]
[]
[]
[]
[]
[]
[]
[]
[]
[]
[]
[]
[]
[]
["Relance"]
[]
["Ai",{"$f":"Saisies!E11","v":0}]
[]
[null,null,"Temps de relance",2,3,4]
[null,{"$f":"HLOOKUP(B207,D199:F203,B206+1,TRUE)","v":25},1,21,34,48]
[null,null,2,15,25,35]
[null,null,3,12,20,29]
[null,null,4,10,18,26]
[]
["ralenti (h)",8]
["h de relance",2]
["t réduit",3]
["Rrh",{"$f":"IF(B205>8,\"temps réduit trop long\",C208)","v":0},{"$f":"IF(B207>4,\"T°C de réduit trop important\",D208)","v":0},{"$f":"B197*B200","v":0}]

{"sheet":"Calcul","index":9,"n_rows":70,"n_cols":24,"rows_kept":70,"cut":false,"hidden":true,"merged":[[10,7,10,10],[40,7,40,8],[40,19,40,20],[34,7,34,8],[34,19,34,20],[35,7,35,8],[35,19,35,20],[36,7,36,8],[36,19,36,20],[37,7,37,8],[37,19,37,20],[38,19,38,20],[39,7,39,8],[39,19,39,20],[24,7,24,8],[24,19,24,20],[19,7,20,16],[21,14,21,16],[23,15,24,15],[33,19,33,20],[26,7,26,8],[28,7,28,8],[29,7,29,8],[29,19,29,20],[30,7,30,8],[30,19,30,20],[31,19,31,20],[32,7,32,12],[32,19,32,20],[33,7,33,8],[17,19,17,20],[19,2,19,4],[19,19,19,20],[20,19,20,20],[22,7,22,8],[22,19,22,20],[21,7,21,10],[21,19,21,20],[23,7,23,8],[23,19,23,20],[66,8,66,10],[67,8,67,10],[68,8,68,10],[67,11,67,12],[68,11,68,12],[31,1,31,2],[18,19,18,20],[13,19,13,20],[1,1,1,4],[1,7,1,15],[1,19,1,22],[3,19,3,20],[4,14,5,14],[4,19,4,20],[9,7,9,10],[9,19,9,20],[10,19,10,20],[11,19,11,20],[12,19,12,20],[14,19,14,20],[15,19,15,20],[16,7,16,10],[16,19,16,20],[17,7,17,10],[68,13,68,14],[54,11,54,12],[55,11,55,12],[62,11,62,12],[63,11,63,12],[64,11,64,12],[65,11,65,12],[66,11,66,12],[60,11,60,12],[61,11,61,12],[61,13,61,14],[62,13,62,14],[63,13,63,14],[64,13,64,14],[58,11,58,12],[57,13,57,14],[57,11,57,12],[69,8,69,10],[69,11,69,12],[69,13,69,14],[57,8,57,10],[56,8,56,10],[56,11,56,14],[65,13,65,14],[52,8,52,14],[59,11,59,14],[54,13,54,14],[55,13,55,14],[60,13,60,14],[55,8,55,10],[59,8,59,10],[60,8,60,10],[61,8,61,10],[62,8,62,10],[63,8,63,10],[64,8,64,10],[65,8,65,10],[58,8,58,10],[58,13,58,14],[66,13,66,14],[67,13,67,14]]}
[]
[null,"DONNES ETUDE ET HYPOTHESES",null,null,null,null,null,"APPORTS INTERNES",null,null,null,null,null,null,null,null,null,null,null,"CALCULS "]
[]
[null,"Ville","Besançon",{"$f":"INDEX('Liste communes'!A2:A5,'Liste communes'!E1,1)","v":"25 Doubs"},null,null,null,null,"SUD","SE-SO","EST","OUEST","NO-NE","NORD","Total apports",null,"H",null,null,"Débit ventilation (réduit ou hygro)",null,{"$f":"VLOOKUP(C11,Ventilation!C35:I54,7,FALSE)","v":{"$error":"#VALUE!"}},"m3/h"]
[null,"Volume bâtiment",{"$f":"Saisies!E11*Saisies!E17","v":0},"m3",null,null,null,"Surface vitrages m²",{"$f":"IF(Chauffage!H20=0,Saisies!F33,'surface auto'!AH11)","v":0},0,{"$f":"IF(Chauffage!H20=0,Saisies!F35,'surface auto'!AH13)","v":0},{"$f":"IF(Chauffage!H20=0,Saisies!F37,'surface auto'!AH14)","v":0},0,{"$f":"IF(Chauffage!H20=0,Saisies!F31,'surface auto'!AH11)","v":0},{"$f":"'Apports solaires'!G29","v":{"$error":"#VALUE!"}},"kwh/an",{"$f":"IF(Chauffage!H20=0,Saisies!F30,0)","v":0},null,null,"Débit ventilation (pointe ou normal)",null,{"$f":"VLOOKUP(C11,Ventilation!C35:I54,6,FALSE)","v":{"$error":"#VALUE!"}},"m3/h"]
[null,"Ubat",{"$f":"IF(Chauffage!H20=0,'surface auto'!AA21,'surface auto'!AL26)","v":0},"A remplir suite au calcul simplifié",null,null,null,"Ombrage",{"$f":"IFERROR(INDEX('Apports solaires'!$J$20:$J$24,I3),0)","v":0},{"$f":"IFERROR(INDEX('Apports solaires'!$J$20:$J$24,J3),0)","v":0},{"$f":"IFERROR(INDEX('Apports solaires'!$J$20:$J$24,K3),0)","v":0},{"$f":"IFERROR(INDEX('Apports solaires'!$J$20:$J$24,L3),0)","v":0},{"$f":"IFERROR(INDEX('Apports solaires'!$J$20:$J$24,M3),0)","v":0},{"$f":"IFERROR(INDEX('Apports solaires'!$J$20:$J$24,N3),0)","v":0},null,null,{"$f":"IFERROR(INDEX('Apports solaires'!$J$20:$J$24,Q3),0)","v":0},null,null,null,"heures à la température de consigne",{"$f":"(24-N66)*365","v":6570},{"$f":"(V6*100)/8760","v":75}]
[null,"Shab",{"$f":"IF(E7<>0,E7,Saisies!E11)","v":0},"m²",null,null,null,null,null,null,null,null,null,"1h janvier :",{"$f":"'Apports solaires'!G60","v":{"$error":"#VALUE!"}},"kwh",null,null,null,null,"heure à la température réduit",{"$f":"8760-V6","v":2190},{"$f":"100-W6","v":25}]
[null,"Shon RT",{"$f":"IF(E8<>0,E8,IF(Saisies!E13=0,Saisies!E11*1.02,Saisies!E13))","v":0}]
[null,"Type appartement/maison",{"$f":"Saisies!E12","v":0},"Créer une case",null,null,null,"Apports autres (désignation)","apports en W","nombre","présence de l'apport en h/an"]
[null,"Nombre de SDB ou SDB+WC ou pièces d'eau supplémentaire",0,null,null,null,null,"apports CH dans l'ambiance",null,null,null,{"$f":"IF(C28=\"OUI\",ECS!K94,ECS!K94-ECS!K89)","v":{"$error":"#VALUE!"}},"kwh/an",null,null,null,null,null,null,"Pertes VMC débit pointe",null,{"$f":"IF(Ventilation!B35=1,0.34*V5*0.2,0.34*V5)","v":{"$error":"#VALUE!"}},"w"]
[null,"Ventilation",{"$f":"IF(Chauffage!H20=1,INDEX(Ventilation!C50:C54,Ventilation!C55,1),INDEX(Ventilation!C35:C46,Ventilation!B35,1))","v":{"$error":"#VALUE!"}},null,"",null,null,"apports ecs dans l'ambiance",null,null,null,{"$f":"((J11*I11)/1000)*K11","v":0},"kwh/an",null,null,null,null,null,null,"pertes VMC débit réduit",null,{"$f":"IF(Ventilation!B35=1,0.34*V4*0.2,0.34*V4)","v":{"$error":"#VALUE!"}},"w"]
[null,"T int",{"$f":"N65","v":20}," °C",null,null,null,null,null,null,null,{"$f":"((J12*I12)/1000)*K12","v":0},"kwh/an",null,null,null,null,null,null,"Temps annuel débit réduit",null,{"$f":"8760-VLOOKUP(IF(E11<>\"\",E11,C11),Ventilation!C35:I54,3,FALSE)","v":{"$error":"#VALUE!"}},"heures"]
[null,"T ext ",{"$f":"IF(E13<>0,E13,INDEX('Liste communes'!G2:G5,'Liste communes'!E1,1))","v":{"$error":"#VALUE!"}},null,null,null,null,null,"éclairage en W/m²","surface en m² concernée","utilisation en h/an",null,null,null,null,null,null,null,null,"déperdition bâti",null,{"$f":"C6*C14","v":0},"W/k",{"$f":"V13+V14","v":{"$error":"#VALUE!"}}]
[null,"surface déperditive totale (m²)",{"$f":"IF(Chauffage!H20=1,'surface auto'!AG26,'surface auto'!Y19)","v":0},"m²",null,null,null,"Eclairage",{"$f":"N70","v":4},{"$f":"C7","v":0},{"$f":"L64*(24-L66)","v":0},{"$f":"((((I14*J14)/1000)*K14))","v":0},"kwh/an","1h écl. Janvier",{"$f":"(I14*J14)/1000","v":0},null,null,null,null,"déperdition ventil",null,{"$f":"((((W6*V10)+(W7*V11))/100))","v":{"$error":"#VALUE!"}},"W/k"]
[null,"Energie principale chauffage",{"$f":"'surface auto'!C17","v":{"$error":"#VALUE!"}},{"$f":"'surface auto'!C17","v":{"$error":"#VALUE!"}},null,null,null,"hommes",20,{"$f":"Saisies!E21","v":0},{"$f":"K14","v":0},{"$f":"(((I15*J15)/1000)*K15)","v":0},"kwh/an",null,null,null,null,null,null,"déperdition bâti ",null,{"$f":"V13/V30","v":{"$error":"#VALUE!"}},"w/m3.k"]
[null,"Energie appoint chauffage",{"$f":"'surface auto'!F17","v":{"$error":"#VALUE!"}},{"$f":"'surface auto'!F17","v":{"$error":"#VALUE!"}},{"$f":"IF(Chauffage!H20=0,IF(Chauffage!H70=9,\"sans appoint\",\"\"),INDEX(Chauffage!F152:F158,Chauffage!G151,1))","v":""},null,null,"Elect spécifique",null,null,null,{"$f":"(((I16*J16)/1000)*K16)*0.9","v":0},"kwh/an",null,null,null,null,null,null,"déperdition ventil ",null,{"$f":"V14/C5","v":{"$error":"#VALUE!"}},"w/m3.k"]
[null,"Energie principale ECS",{"$f":"'surface auto'!I9","v":{"$error":"#VALUE!"}},{"$f":"'surface auto'!I9","v":{"$error":"#VALUE!"}},null,null,null,"total",null,null,null,{"$f":"L14+L15+L16","v":0},"kwh/an"]
[null,null,null,null,null,null,null,null,null,null,null,null,"kwh/an"]
[null,"Rendement générateur chauffage principal (%)",{"$f":"IF(D19<>0,D19,'surface auto'!C18)","v":{"$error":"#VALUE!"}}]
[null,"type de chauffage principal",{"$f":"INDEX(Chauffage!H42:H51,Chauffage!H41,1)","v":{"$error":"#VALUE!"}},null,null,null,{"$f":"'surface auto'!C13","v":{"$error":"#VALUE!"}},"RESULTATS"]
[null,"Rendement générateur chauffage appoint (%)",{"$f":"'surface auto'!F18","v":{"$error":"#VALUE!"}}]
[null,"Ecs produite par le générateur de chauffage?",{"$f":"IF(OR(Chauffage!A91=2,Chauffage!A91=4),\"OUI\",\"NON\")","v":"NON"},{"$f":"'surface auto'!I11","v":{"$error":"#VALUE!"}},null,null,null,"Besoins chauffage (énergie finale)",null,null,null,null,null,null,"Energie primaire"]
[null,"Nombre de personnes (pour ECS)",{"$f":"Saisies!E21","v":0},{"$f":"Saisies!E21","v":0},null,null,null,"Besoin net chauffage",null,{"$f":"IFERROR(Chauffage!K18,0)","v":0},"kwh/an",null,null,null,"Kwh EP","Kwh Ep/m².an","C02"]
[null,"besoins ECS en L par jour par personne",{"$f":"N61","v":35},"valeur par défaut","Case forcée",null,null,"Conso combustible principal",null,{"$f":"IF(C16=\"Solaire\",(((J23*W39)/V40))-'surface auto'!G31,(((J23*W39)/V40)))","v":{"$error":"#VALUE!"}},"kwh/an",{"$f":"((J24)*V32)","v":{"$error":"#VALUE!"}},{"$f":"VLOOKUP(C15,'Tarif combustible'!B3:D9,3,FALSE)","v":{"$error":"#VALUE!"}},{"$f":"J24*V33","v":{"$error":"#VALUE!"}},{"$f":"((J24)*VLOOKUP(C15,'Tarif combustible'!B3:H9,7,FALSE))","v":{"$error":"#VALUE!"}},{"$f":"IFERROR((O24+O25)/V38,0)","v":0},{"$f":"IF(Chauffage!H20=0,((INDEX('Tarif combustible'!L3:L15,'Tarif combustible'!C17,1)*J24)/C8),((INDEX('Tarif combustible'!L3:L15,'Tarif combustible'!D17,1)*J24)/C8))","v":{"$error":"#VALUE!"}}]
[null,"Volume ballon",{"$f":"N62","v":0},null,null,null,null,{"$f":"IF(AND(Chauffage!H20=0,Chauffage!H70=10),\"Production solaire\",IF(AND(Chauffage!G151=6,Chauffage!H20=1),\"Production solaire\",\"Conso combustible appoint\"))","v":"Conso combustible appoint"},null,{"$f":"IF(OR(C16=\"Solaire\",E16=\"sans appoint\"),0,((J23*V39)/V41)-'surface auto'!G31)","v":{"$error":"#VALUE!"}},"kwh/an",{"$f":"((J25)*V34)","v":{"$error":"#VALUE!"}},{"$f":"IF(OR(D16=0,D16=\"sans appoint\"),\"kwh\",VLOOKUP(C16,'Tarif combustible'!B3:D10,3,FALSE))","v":{"$error":"#VALUE!"}},{"$f":"J25*V35","v":{"$error":"#VALUE!"}},{"$f":"IF(J25=0,0,(J25)*VLOOKUP(C16,'Tarif combustible'!B3:H9,7,FALSE))","v":{"$error":"#VALUE!"}},null,{"$f":"IFERROR((INDEX('Tarif combustible'!L3:L15,'Tarif combustible'!C18,1)*J25)/C8,0)","v":0}]
[null,"consigne du ballon",{"$f":"N63","v":55},"°C","Valeur par défaut"]
[null,"nombre jours de puisage ECS",{"$f":"N64","v":330},"jours","Valeur par défaut",null,null,"Besoins ECS",null,{"$f":"IF((ECS!I106-(C30*ECS!I106)-'surface auto'!G32)<0,0,ECS!I106-(C30*ECS!I106)-'surface auto'!G32)","v":{"$error":"#N/A"}},"kwh/an",{"$f":"((J27)*V36)","v":{"$error":"#N/A"}},{"$f":"VLOOKUP(C17,'Tarif combustible'!B3:G9,3,FALSE)","v":{"$error":"#VALUE!"}},{"$f":"J27*V37","v":{"$error":"#N/A"}},{"$f":"J27*VLOOKUP(C17,'Tarif combustible'!B3:H9,7,FALSE)","v":{"$error":"#N/A"}},{"$f":"O27/V38","v":{"$error":"#N/A"}},{"$f":"(INDEX('Tarif combustible'!M3:M9,'Tarif combustible'!C19,1)*J27)/C8","v":{"$error":"#VALUE!"}}]
[null,"ballon en volume chauffé?",{"$f":"L60","v":"NON"}]
[null,"Reduction solaire sur le chauffage +ECS",{"$f":"IF(OR(C33=\"Chauffage + ECS\",C33=\"Chauffage\"),C39,0)","v":0},null,null,null,null,"Consommation auxiliaires",null,{"$f":"IF(Chauffage!H20=1,INDEX(Chauffage!N136:S144,Chauffage!H134,6)+INDEX(Chauffage!N151:S157,Chauffage!G151,6),INDEX(Chauffage!M36:R45,Chauffage!H41,6)+INDEX(Chauffage!M72:R81,Chauffage!H70,6))","v":{"$error":"#VALUE!"}},"kwh/an",null,null,{"$f":"J29*'Tarif combustible'!G3","v":{"$error":"#VALUE!"}},{"$f":"J29*2.58","v":{"$error":"#VALUE!"}},{"$f":"O29/V38","v":{"$error":"#VALUE!"}},{"$f":"(J29*'Tarif combustible'!P3)/C8","v":{"$error":"#VALUE!"}}]
[null,"Reduction solaire sur l'ECS",{"$f":"IF(C33=\"ECS\",C39,IF(C33=\"Chauffage + ECS\",C29,0))","v":0},null,1,0,null,"Consommation aux de  ventilation",null,{"$f":"IFERROR(VLOOKUP(C11,Ventilation!C35:I54,5,FALSE),0)","v":0},"kwh/an",null,null,{"$f":"J30*'Tarif combustible'!G3","v":0},{"$f":"J30*2.58","v":0},{"$f":"O30/V38","v":{"$error":"#DIV/0!"}},{"$f":"(J30*'Tarif combustible'!P3)/Calcul!C8","v":{"$error":"#DIV/0!"}},null,null,"période de chauffe",null,{"$f":"Chauffage!R18","v":{"$error":"#VALUE!"}},"jours"]
[null,null,null,null,null,null,null,"Consommation Eclairage",null,{"$f":"L14","v":0},"kwh/an",null,null,{"$f":"J31*'Tarif combustible'!G3","v":0},{"$f":"J31*2.58","v":0},{"$f":"O31/V38","v":{"$error":"#DIV/0!"}},{"$f":"(J31*'Tarif combustible'!O3)/Calcul!C8","v":{"$error":"#DIV/0!"}}]
[null,"Solaire thermique",null,null,null,null,null,null,null,null,null,null,null,null,null,null,null,null,null,"PCI combustible principal chauffage",null,{"$f":"VLOOKUP(C15,'Tarif combustible'!B3:F9,5,FALSE)","v":{"$error":"#VALUE!"}},"kwh pci /u"]
[null,"Utilisation",{"$f":"IF(AND(OR(Chauffage!A91=5,Chauffage!A91=4),Chauffage!H70<>10),\"ECS\",IF(AND(OR(Chauffage!A91=4,Chauffage!A91=5),Chauffage!H70=10),\"Chauffage + ECS\",IF(AND(OR(Chauffage!A91=1,Chauffage!A91=2,Chauffage!A91=3),Chauffage!H70=10),\"Chauffage\")))","v":false},{"$f":"IF(Saisies!G88=\"OUI\",1,0)","v":0},"CH",null,null,"total",null,null,null,null,null,{"$f":"N24+N25+N27+N29+N30+N31","v":{"$error":"#VALUE!"}},{"$f":"O24+O25+O27+O29+O30+O31","v":{"$error":"#VALUE!"}},{"$f":"P24+P27+P29+P30+P31","v":{"$error":"#N/A"}},{"$f":"SUM(Q24:Q31)","v":{"$error":"#VALUE!"}},null,null,"cout en €/ kwh",null,{"$f":"IF(W33<>0,W33,VLOOKUP(C15,'Tarif combustible'!B3:G9,6,FALSE))","v":{"$error":"#VALUE!"}}]
[null,null,null,{"$f":"IFERROR(INDEX(Chauffage!E92:E96,Chauffage!A91,1),0)","v":0},"ECS",null,null,null,null,null,null,null,null,null,null,null,null,null,null,"PCI combustible appoint chauffage",null,{"$f":"IFERROR(VLOOKUP(C16,'Tarif combustible'!B3:F9,5,FALSE),1)","v":1},"kwh pci /u"]
[null,null,null,null,null,null,null,null,null,null,null,null,null,null,null,null,null,null,null,"cout en €/ kwh",null,{"$f":"IFERROR(VLOOKUP(C16,'Tarif combustible'!B3:G9,6,FALSE),1)","v":1}]
[null,"ECS",{"$f":"ECS!I106","v":{"$error":"#N/A"}},null,null,null,null,null,null,null,null,null,null,null,null,null,null,null,null,"PCI combustible ECS",null,{"$f":"VLOOKUP(C17,'Tarif combustible'!B3:F9,5,FALSE)","v":{"$error":"#VALUE!"}},"kwh pci /u"]
[null,"Ch",{"$f":"Chauffage!K18*W39","v":{"$error":"#VALUE!"}},null,null,null,null,null,null,null,null,null,null,null,null,null,null,null,null,"cout en €/ kwh",null,{"$f":"VLOOKUP(C17,'Tarif combustible'!B3:G9,6,FALSE)","v":{"$error":"#VALUE!"}}]
[null,"tot",{"$f":"SUM(C36:C37)","v":{"$error":"#N/A"}},null,null,null,null,null,null,null,null,null,null,null,null,null,null,null,null,"Shon RT",null,{"$f":"IF(Saisies!E13<>\"\",Saisies!E13,1.2*Saisies!E11)","v":0},"m²"]
[null,"Taux de couverture solaire (%)",{"$f":"IFERROR(IF(C33=\"ECS\",SOLAIRE!E28,SOLAIRE!F28),0)","v":0},null,null,null,null,null,null,null,null,null,null,null,null,null,null,null,null,"couverture",null,{"$f":"N69/100","v":0.3},{"$f":"1-V39","v":0.7}]
[null,null,null,null,null,null,null,null,null,null,null,null,null,null,null,null,null,null,null,"Rendement Chauffage principal",null,{"$f":"C19","v":{"$error":"#VALUE!"}}]
[null,null,null,null,null,null,null,null,null,null,null,null,null,null,null,null,null,null,null,"Rendement Chauffage appoint",null,{"$f":"C21","v":{"$error":"#VALUE!"}}]
[]
[]
[]
[]
[]
[]
[]
[]
[]
[]
[]
[null,null,null,null,null,null,null,null,"Paramètres par défault et règlages supplémentaires"]
[]
[null,null,null,null,null,null,null,null,null,null,null,"Valeur forcée",null,"Valeur par défaut"]
[null,null,null,null,null,null,null,null,"surface des capteurs solaires (forcé)",null,null,null,null,{"$f":"IF(L56<>0,L56,IF(C33=\"ECS\",Saisies!E21,ROUNDUP(Calcul!C7/15,0)))","v":0}]
[null,null,null,null,null,null,null,null,"Type capteur",null,null,0]
[null,null,null,null,null,null,null,null,"Orientation du plan",null,null,null,null,{"$f":"IF(L58<>\"\",L58,\"Sud\")","v":"Sud"}]
[null,null,null,null,null,null,null,null,"Inclinaison du plan",null,null,null,null,{"$f":"IF(L59<>0,L59,45)","v":45}]
[null,null,null,null,null,null,null,null,"ballon ECS en volume chauffé?",null,null,"NON"]
[null,null,null,null,null,null,null,null,"besoins ECS en L par jour par personne",null,null,null,null,{"$f":"IF(L61<>0,L61,35)","v":35}]
[null,null,null,null,null,null,null,null,"Volume ballon",null,null,null,null,{"$f":"IF(L62<>0,L62,ROUNDDOWN(C23*75,-2))","v":0}]
[null,null,null,null,null,null,null,null,"consigne du ballon",null,null,null,null,{"$f":"IF(L63<>0,L63,55)","v":55}]
[null,null,null,null,null,null,null,null,"nombre jours de puisage ECS",null,null,null,null,{"$f":"IF(L64<>0,L64,330)","v":330}]
[null,null,null,null,null,null,null,null,"consigne T° en occupation",null,null,null,null,{"$f":"IF(L65<>0,L65,20)","v":20}]
[null,null,null,null,null,null,null,null,"nombre d'heures de réduit de nuit",null,null,null,null,{"$f":"IF(L66<>0,L66,6)","v":6}]
[null,null,null,null,null,null,null,null,"température réduit  (nombre de degrés de réduit)",null,null,null,null,{"$f":"IF(L67<>0,L67,2)","v":2}]
[null,null,null,null,null,null,null,null,"Forcer rendement de la chaudière (en %)",null,null,null,null,"En fonction des saisies"]
[null,null,null,null,null,null,null,null,"Taux de couverture de l'appoint (en %)",null,null,null,null,{"$f":"IF(L69<>0,L69,IF(Chauffage!H70=9,0,IF(AND(Chauffage!H20=0,Chauffage!H70=10),0,30)))","v":30}]
[null,null,null,null,null,null,null,null,"puissance éclairage en w/m²",null,null,null,null,{"$f":"IF(L70>0,L70,4)","v":4}]

{"sheet":"Saisies","index":10,"n_rows":295,"n_cols":26,"rows_kept":295,"cut":false,"hidden":true,"merged":[[6,4,8,5],[6,3,8,3],[6,2,8,2],[9,4,9,5],[30,6,31,6],[17,2,19,2],[20,4,20,5],[13,2,14,2],[13,3,14,3],[13,4,14,5],[10,2,12,2],[29,2,37,2],[29,3,32,3],[32,6,33,6],[21,4,21,5],[22,6,22,7],[22,4,22,5],[30,7,37,7],[36,6,37,6],[1,6,1,8],[166,3,167,3],[15,4,15,5],[138,8,138,11],[146,8,146,11],[5,4,5,5],[17,4,17,5],[52,3,53,3],[58,3,59,3],[14,6,14,7],[13,6,13,7],[1,4,1,5],[11,4,11,5],[40,7,47,7],[34,6,35,6],[40,6,41,6],[102,12,102,13],[93,12,93,13],[94,12,94,13],[99,12,99,13],[101,12,101,13],[42,8,43,8],[44,6,45,6],[46,6,47,6],[48,6,51,6],[42,6,43,6],[92,6,92,7],[225,6,225,7],[62,7,63,7],[240,2,247,2],[263,2,271,2],[251,2,259,2],[230,4,230,5],[173,2,183,2],[187,2,195,2],[225,2,236,2],[65,3,68,3],[62,2,63,2],[62,3,63,3],[225,4,225,5],[83,4,83,5],[78,2,88,2],[90,2,96,2],[58,2,59,2],[60,2,61,2],[60,3,61,3],[38,2,39,2],[38,3,39,3],[48,3,51,3],[52,2,55,2],[56,2,57,2],[56,3,57,3],[40,2,51,2],[40,3,47,3]]}
[]
[null,null,null,"Bilan énergétique d'un bâtiment","Nom de l'opération :"]
[]
[null,null,"1°","Données Techniques"]
[]
[null,null,"1.","typologie de bâtiment (menu déroulant) :"]
[null,null,"2.","Nombre d'étages \ndu bâtiment\n"]
[]
[]
[null,null,"3.","Nombre de logements (pour le tertiaire =1 )"]
[null,null,"4.","Surface habitable/utile du bâtiment",null,"m²"]
[null,null,null,"Typologie de ventilation (pour le tertaire saisie manuelle des débits)"]
[null,null,null,"ShonRT (remplir si connue, sinon 1,2xshab sera pris par défaut)",null,"m²"]
[null,null,"5.","Ville (cliquer sur l'image pour afficher la carte\nou directement dans la liste)",null,null,"Zone climatique",null,null,null,null,null,null,null,null,null,null,null,null,null,null,null,null,null,null,{"$f":"(Saisies!E35+Saisies!E35)/(Saisies!F35+Saisies!F36)","v":{"$error":"#DIV/0!"}}]
[null,null,null,null,null,null,{"$f":"IFERROR(INDEX('Liste communes'!CD20:CD29,'Liste communes'!A18,1),\"\")","v":""}]
[null,null,"6.","Mitoyenneté\n(cliquer sur l'image\nou dans la liste)",0]
[null,null,"7.","Hauteur moyenne sous plafonds",null,"m",null,null,null,null,null,null,null,null,null,null,null,null,{"$f":"ETIQUETTES!I30","v":0},null,{"$f":"ETIQUETTES!K30","v":0},{"$f":"ETIQUETTES!L30","v":0},{"$f":"ETIQUETTES!M30","v":0}]
[null,null,"8.","Forme du bâtiment (cliquer sur l'image ou dans la liste)"]
[null,null,null,null,null,null,null,null,null,null,null,null,null,null,null,null,null,null,{"$f":"ETIQUETTES!I32","v":0},null,{"$f":"ETIQUETTES!K32","v":0},{"$f":"ETIQUETTES!L32","v":0},{"$f":"ETIQUETTES!M32","v":0}]
[]
[null,null,"6.","Nombre d'occupants (par logements, ou pour le bâtiment en tertaire)"]
[null,null,"10.","Type d'isolation "]
[null,null,"11.","Type de plancher / Type de plafond"]
[]
[]
[]
[]
[null,null,"2°","Bâti (Saisie manuelle)"]
[null,null,null,"Parois de la superficie de déperdition thermique","U         [W/(m².K)]","Surface    [m²]","Orientation","Tau (b)","Masque solaire"]
[null,null,"1.","Fenêtres vélux et autres parois translucides "," ",null,"Horizonale",1]
[null,null,null,null,null,null,"Nord ",1,{"$f":"(E31*F31*H31)+(E32*F32*H31)","v":0}]
[]
[null,null,null,null,null,null,"Sud ",null,{"$f":"(E33*F33*H31)+(E34*F34*H31)","v":0}]
[null,null,null,"Facteur solaire (vitrage le plus représentatif)?"]
[null,null,null,null,null,null,"Est",null,{"$f":"(E35*F35*H31)+(E36*F36*H31)","v":0}]
[]
[null,null,null,null,null,null,"Ouest",null,{"$f":"(E37*F37*H31)+(E38*F38*H31)","v":0}]
[]
[null,null,"2.","Portes extérieures ",null,null,null,null,{"$f":"E39*F39*H39","v":0}]
[null,null,null,null,null,null,null,null,{"$f":"E40*F40*H40","v":0}]
[null,null,"3.","Murs extérieurs, façades ",null,null,"Nord ",1,{"$f":"(E41*F41*H41)+(E42*F42*H41)","v":0}]
[]
[null,null,null,null,null,null,"Sud",null,"Inertie :"]
[]
[null,null,null,null,null,null,"Est",null,{"$f":"(E45*F45*H41)+(E46*F46*H41)","v":0}]
[]
[null,null,null,null,null,null,"Ouest",null,{"$f":"(E48*F48*H41)+(E47*F47*H41)","v":0}]
[]
[null,null,null,"Murs intérieurs, LNC",null,null,"intérieur",null,{"$f":"E49*F49*H49","v":0}]
[null,null,null,null,null,null,null,null,{"$f":"E50*F50*H50","v":0}]
[null,null,null,null,null,null,null,null,{"$f":"E51*F51*H51","v":0}]
[null,null,null,null,null,null,null,null,{"$f":"E52*F52*H52","v":0}]
[null,null,"4.","Toit des combles aménagés",null,null,null,1,0]
[null,null,null,null,null,null,null,1,0]
[null,null,null,"Plancher haut lèger sous combles non aménagés ou sur ext",null,null,null,null,0]
[null,null,null,"Plancher haut lourd sous combles non aménagés ou sur ext",null,null,null,null,0]
[null,null,"5.","Planchers au-dessus de l'ambiance extérieure ",null,null,null,1,0]
[null,null,null,null,null,null,null,1,{"$f":"E58*F58*H58","v":0}]
[null,null,"6.","Planchers au-dessus d'espaces voisins non à l'abri du gel (vide sanitaire) ",null,null,null,null,{"$f":"E59*F59*H59","v":0}]
[null,null,null,null,null,null,null,null,{"$f":"E60*F60*H60","v":0}]
[null,null,"7.","Planchers au-dessus d'espaces voisins à l'abri du gel (caves)",null,null,null,null,{"$f":"E61*F61*H61","v":0}]
[null,null,null,null,null,null,null,null,{"$f":"E62*F62*H62","v":0}]
[null,null,"8.","Planchers sur le sol ",null,null,null,1,0]
[null,null,null,null,null,null,null,null,0]
[null,null,null,"PONTS THERMIQUES","psi [W/(m.K)]","longueur [m]","psi [W/(m.K)]","longueur [m]"]
[null,null,"13.","Tous types de ponts thermiques (L8, L9, L10, angles sortants, refends..)\nattention : ne saisir que L8 - L9 - L10  dans les cases oranges les autres cases permettent de saisir les autres types de ponts thermiques",null,null,null,null,null,{"$f":"E66*F66","v":0}]
[null,null,null,null,null,null,null,null,null,{"$f":"E67*F67","v":0}]
[null,null,null,null,null,null,null,null,null,{"$f":"E68*F68","v":0}]
[]
[]
[]
[]
[]
[]
[]
[null,null,"3° ","Saisie des systèmes"]
[]
[]
[null,null,"3.","Type de chauffage","Energie"]
[]
[]
[]
[]
[null,null,null,"Chaudière                                                     Régulation"]
[]
[]
[null,null,null,"\n\n\n\nancienneté"]
[]
[]
[]
[null,null,"4.","Ventilation et perméabilité à l'air"]
[null,null,null,null,null,null,"Si valeur perso : Valeur du Q4 :",3]
[null,null,null,"Degré d'étanchéité à l'air de l'enveloppe\n du bâtiment (qualité des joints de fenêtre)"]
[null,null,null,null,null,null,"Debit inocc. m3/h :","Débit occup. m3/h :"]
[null,null,null,"Système de ventilation"]
[null,null,null,null,null,null,"consomation du moteur en Wthc :"]
[]
[]
[]
[]
[]
[]
[]
[]
[]
[]
[]
[]
[]
[]
[]
[]
[]
[]
[]
[]
[]
[]
[]
[]
[]
[]
[]
[]
[]
[]
[]
[]
[]
[]
[]
[]
[]
[]
[]
[]
[]
[]
[]
[]
[]
[]
[]
[]
[]
[]
[]
[]
[]
[]
[]
[null,null,null,null,null,null,null,null,null,null,null,null,1]
[null,null,null,null,null,null,null,null,null,null,null,null,null,null,null,1]
[]
[]
[]
[]
[]
[]
[]
[]
[null,null,null,null,null,null,null,null,null,null,null,null,3]
[null,null,null,null,null,null,null,null,null,null,null,null,null,null,null,3]
[null,null,null,null,null,null,null,null,null,null,null,null,1]
[null,null,null,null,null,null,null,null,null,null,null,1,null,"forme",null,1,null,0]
[null,null,null,null,null,null,null,null,null,null,null,null,"1- Carré - Rectangle",4,0,null,"1 - Indépendant",1]
[null,null,null,"AFFICHE",{"$f":"AfficheCache($E$7,1,\"1\")","v":0},{"$f":"AfficheCache($E$7,1.5,\"1_5\")","v":0},{"$f":"AfficheCache($E$7,2,\"2\")","v":0},{"$f":"AfficheCache($E$7,2.5,\"2_5\")","v":0},{"$f":"AfficheCache($E$7,3,\"3\")","v":0},{"$f":"AfficheCache2($E$7,3,\"3,5\")","v":0},{"$f":"AfficheCache2($E$7,3,\"4\")","v":0},null,"2- Peu découpé ",5,1,null,"2- un petit coté",2]
[null,null,null,null,{"$f":"AfficheCache($M$165,1,\"form1\")","v":0},{"$f":"AfficheCache($M$165,2,\"form2\")","v":0},{"$f":"AfficheCache($M$165,3,\"form3\")","v":0},null,null,null,null,null,"3- très découpé",6,2,null,"3- deux petits cotés",2]
[null,null,null,null,null,null,null,null,null,null,null,null,"autres..",10,3,null,"4- un petit et un grand",1]
[null,null,null,null,null,null,null,null,null,null,null,null,null,null,null,null,"5- un grand coté",2]
[null,null,null,null,null,null,null,null,null,null,null,null,null,null,null,null,"6- deux grands cotés",{"$f":"AfficheCache($P$166,1,\"IND\")","v":0},{"$f":"AfficheCache($P$166,2,\"1PC\")","v":0},{"$f":"AfficheCache($P$166,3,\"2PC\")","v":0},{"$f":"AfficheCache($P$166,4,\"1P1G\")","v":0},{"$f":"AfficheCache($P$166,5,\"1G\")","v":0},{"$f":"AfficheCache($P$166,6,\"2GC\")","v":0}]
[null,null,null,"3° Appoint chauffage (second système ou solaire)"]
[]
[null,null,5,"                      Système                      Energie",null,"   Emission"]
[]
[]
[]
[]
[]
[null,null,null,null,null,"        Ancienneté"]
[]
[]
[]
[]
[]
[null,null,null,"3° ECS"]
[]
[null,null,6,"                      Système","Ancienneté"]
[]
[]
[]
[]
[]
[]
[]
[]
[]
[]
[null,null,6,"Système","Energie"]
[]
[]
[]
[null,null,null,null,"dyjeyj"]
[]
[]
[]
[]
[]
[]
[]
[]
[]
[]
[]
[]
[]
[]
[]
[]
[]
[]
[]
[]
[null,null,"2° ","Chauffage principal"]
[]
[null,null,"2.","Chaudière                                                          Emission","        Energie",null,"Ancienneté"]
[]
[]
[]
[]
[]
[]
[null,null,null,"                                                                    Isolation distribution"]
[]
[]
[]
[]
[]
[null,null,"3° ","Chauffage appoint "]
[]
[null,null,"3.","Système"]
[]
[]
[]
[]
[]
[]
[]
[]
[null,null,"4° ","ECS"]
[]
[null,null,"4.","Système","Installation"]
[]
[]
[]
[]
[]
[]
[]
[]
[]
[null,null,"5° ","Ventilation"]
[]
[null,null,"5.","Ventilation"]
[]
[null,null,null,"Degré d'étanchéité à l'air de l'enveloppe\n du bâtiment (qualité des joints de fenêtre)"]
[]
[null,null,null,"Système de ventilation"]
[]
[]
[]
[]
[]
[]
[]
[]
[]
[]
[]
[null,null,null,null,null,null,null,null,null,null,null,null,null,null,"Est"]
[null,null,null,null,null,null,null,null,null,null,null,null,null,"Chauffage seul","Sud - Est"]
[null,null,null,null,null,null,null,null,null,null,null,null,null,"ECS seule","Sud"]
[null,null,null,null,null,null,null,null,null,null,null,null,null,"Chauffage et ECS","Sud - Ouest"]
[null,null,null,null,null,null,null,null,null,null,null,null,null,null,"Ouest"]
[]
[]
[]
[null,null,null,"Utilisation","ECS seule"]
[null,null,null,"Inclinaison du plan",{"$f":"IF(E288=\"\",\"\",IF(E288=\"ECS seule\",45,60))","v":45}]
[null,null,null,"Orientation du plan","Sud"]
[null,null,null,"Surface panneaux (m²)"]
[null,null,null,"Productivité totale (kWh/an)",{"$f":"IF(E288=\"\",\"\",E293*E291)","v":{"$error":"#DIV/0!"}}]
[null,null,null,"Productivité annuelle (kWh/m².an)",{"$f":"IF(E289=60,IF(E290=\"Sud\",804.79*E291^(-0.62),IF(E290=\"Sud - Est\",795.37*E291^(-0.64),IF(E290=\"Sud - Ouest\",795.37*E291^(-0.64),IF(E290=\"Ouest\",665.23*E291^(-0.609),IF(E290=\"Est\",665.23*E291^(-0.609),\"\"))))),IF(E290=\"Sud\",743*E291^(-0.389),IF(E290=\"Sud - Est\",813.19*E291^(-0.654),IF(E290=\"Sud - Ouest\",813.19*E291^(-0.654),IF(E290=\"Ouest\",720.54*E291^(-0.629),IF(E290=\"Est\",720.54*E291^(-0.629),\"\"))))))","v":{"$error":"#DIV/0!"}}]
[]
[null,null,null,"Taux de couverture solaire (%)",{"$f":"IF(E289=45,E292*100/Calcul!J27,IF(Saisies!E288=\"Chauffage seul\",Saisies!E292*100/Calcul!J23,Saisies!E292*100/(Calcul!J23+Calcul!J27)))","v":{"$error":"#DIV/0!"}}]

{"sheet":"Liste communes","index":11,"n_rows":136,"n_cols":82,"rows_kept":136,"cut":false,"hidden":true,"merged":[[33,19,34,30],[14,60,14,71],[14,19,15,30],[14,5,14,17],[14,32,14,43],[14,45,14,56]]}
["Commune","- Temp de base",null,"Cellule :",1,"T° eau","temp ext "]
["25 Doubs",25,"H1c","argile ou limon","H1",10.5,{"$f":"VLOOKUP(J39,J40:N52,4,TRUE)","v":{"$error":"#VALUE!"}},46.3]
["39 Jura",90,"H1c","sable ou gravier","H1",8.41,{"$f":"VLOOKUP(I39,J40:N52,3,TRUE)","v":{"$error":"#VALUE!"}},46.3]
["70 Haute Saone",39,"H1b","sol par roche homogène","H1",10.3,{"$f":"VLOOKUP(I39,J40:N52,2,TRUE)","v":{"$error":"#VALUE!"}},48.58]
["90 Territoire de Belfort",70,"H1b","roche homogène","H1",9.6,{"$f":"VLOOKUP(I39,J40:N52,5,TRUE)","v":{"$error":"#VALUE!"}},48.58]
[]
["400m ≤ altitude",1,0]
["400m < altitude ≤ 800m",null,1]
["altitude > 800m",null,2]
[]
[]
[]
[]
[]
["DEPARTEMENT",null,"LATITUDE","ZONE","ALTITUDE","DEGRES-JOURS",null,null,null,null,null,null,null,null,null,null,null,null,null,"GLOBAL HORIZONTAL OU FRACTION SOLAIRE (kWh/j.m² ou sans unité)",null,null,null,null,null,null,null,null,null,null,null,null,"TEMPERATURE EXTERIEURE (°C)",null,null,null,null,null,null,null,null,null,null,null,null,"TEMPERATURE EAU FROIDE (°C)",null,null,null,null,null,null,null,null,null,null,null,null,null,null,"ENSOLEILLEMENT VERTICAL SUD (kWh/j.m²)",null,null,null,null,null,null,null,null,null,null,null,null,"DISTANCE/MER",null,"Données départementales"]
[null,null,"(° )",null,"(m)",31,28,31,30,31,30,31,31,30,31,30,31,365,null,null,null,null,null,null,null,null,null,null,null,null,null,null,null,null,null,null,null,null,null,null,null,null,null,null,null,null,null,null,null,null,null,null,null,null,null,null,null,null,null,null,null,null,null,null,null,null,null,null,null,null,null,null,null,"(km)"]
[]
[null,null,null,null,null,"Jan","Fév","Mar","Avr","Mai","Jun","Jul","Aoû","Sep","Oct","Nov","Déc","Année",null,"Jan","Fév","Mar","Avr","Mai","Jun","Jul","Aoû","Sep","Oct","Nov","Déc",null,"Jan","Fév","Mar","Avr","Mai","Jun","Jul","Aoû","Sep","Oct","Nov","Déc",null,"Jan","Fév","Mar","Avr","Mai","Jun","Jul","Aoû","Sep","Oct","Nov","Déc",null,null,null,"Jan","Fév","Mar","Avr","Mai","Jun","Jul","Aoû","Sep","Oct","Nov","Déc","Moyen /Année",null,null,"Département","Zone","Durée chauffe","C3","C4","CCL"]
[1,"AMBERIEU (01)",45.98,"H1",253,499,390,348,258,142,53,0,0,84,213,366,484,2837,"AMBERIEU (01)",1.01,1.68,2.78,4.08,5.01,5.62,6.05,4.8499999999999996,3.65,2.2999999999999998,1.1399999999999999,0.75,null,1.5,3,7.2,10.3,14.1,17.399999999999999,19.5,19.3,16.5,11.1,6.3,2.5,null,6.1,6.9,9,10.5,12.4,14.1,15.1,15,13.6,10.9,8.5,6.6,10.725,null,null,1.4,1.91,2.4900000000000002,2.78,2.74,2.77,3.06,3.01,3.03,2.56,1.49,1.04,2.356666666666666,290,null,1,"H1",4900,1.5,null,1]
[21,"DIJON (21)",47.38,"H1",220,498,400,348,238,144,51,0,0,68,214,375,491,2827,"DIJON (21)",0.92,1.72,2.82,4.2300000000000004,4.9800000000000004,5.64,5.82,4.74,3.72,2.15,1.06,0.73,null,1.4,2.8,7.1,10.5,14.3,17.5,19.5,19.100000000000001,16.100000000000001,10.8,5.9,2.2999999999999998,null,6,6.7,8.9,10.6,12.5,14.1,15.1,14.9,13.4,10.7,8.3000000000000007,6.5,10.641666666666667,null,null,1.33,2.09,2.64,2.98,2.79,2.84,3.04,3.02,3.22,2.46,1.44,1.1000000000000001,2.4125000000000001,400,null,"20A","H3",3840,1.8,5,1.1000000000000001,"H1c"]
[25,"BESANCON (25)",47.25,"H1",311,500,405,358,259,157,66,0,0,84,220,374,490,2913,"BESANCON (25)",0.94,1.72,2.93,4.25,5.43,5.94,6.04,4.9800000000000004,3.72,2.35,1.1599999999999999,0.8,null,1.3,2.5,6.8,9.9,13.7,17,18.8,18.600000000000001,15.9,10.7,5.9,2.2000000000000002,null,5.8,6.4,8.5,10.1,12,13.6,14.5,14.4,13.1,10.5,8.1,6.2,10.266666666666667,null,null,1.36,2.08,2.76,2.99,3.02,2.96,3.13,3.17,3.21,2.78,1.64,1.25,2.5291666666666668,440,null,21,"H1",4900,1.5,null,1,"H1c"]
[25,"PONTARLIER (25)",46.9,"H1",830,570,487,463,356,237,141,0,0,154,276,428,542,3654,"PONTARLIER (25)",0.24,0.41,0.4,0.4,0.39,0.41,0.51,0.42,0.44,0.37,0.33,0.3,null,-0.4,0.8,3.1,6.1,10.4,13.5,16.100000000000001,15.8,12.9,9.1,3.7,0.5,null,5.8,6.4,8.5,10.1,12,13.6,14.5,14.4,13.1,10.5,8.1,6.2,10.266666666666667,null,null,1.36,2.08,2.76,2.99,3.02,2.96,3.13,3.17,3.21,2.78,1.64,1.25,2.5291666666666668,440,null,22,"H2",5400,null,5,1,"H1c"]
[39,"MONTMOROT (39)",46.7,"H1",250,507,395,340,261,152,27,0,0,61,200,370,446,2759,"MONTMOROT (39)",0.16,0.28999999999999998,0.33,0.42,0.4,0.5,0.56999999999999995,0.53,0.53,0.31,0.26,0.19,null,1.6,3.9,7,9.3000000000000007,13.1,17.100000000000001,19.600000000000001,18.399999999999999,16,11.5,5.7,3.6,null,5,5,6,9,11,13,14,14,13,11,9,6,9.6666666666666661,null,null,1.2,1.91,2.27,2.66,2.5099999999999998,2.73,2.94,2.97,3.11,2.04,1.61,1.24,2.2658333333333327,600,null,null,null,null,null,null,null,"H1c"]
[39,"CHAMPAGNOLE (39)",46.75,"H1",530,493,430,375,303,160,87,0,0,131,234,379,481,3073,"CHAMPAGNOLE (39)",0.25,0.35,0.39,0.42,0.4,0.47,0.56999999999999995,0.5,0.52,0.44,0.33,0.28000000000000003,null,2.1,2.8,6,7.9,12.9,15.5,18.8,18.7,13.8,10.5,5.4,2.5,null,4,4,6,8,11,12,13,13,10,9,5,5,8.3333333333333339,null,null,1.52,2.16,2.52,2.66,2.52,2.65,2.94,2.87,3.06,2.61,1.89,1.56,2.4133333333333331,600,null,null,null,null,null,null,null,"H1c"]
[39,"SAINT CLAUDE (39)",46.4,"H1",434,500,413,358,282,156,57,0,0,96,217,375,464,2918,"SAINT CLAUDE (39)",0.18,0.24,0.34,0.34,0.35,0.39,0.49,0.45,0.49,0.39,0.28000000000000003,0.19,null,0.5,2.1,4.2,7.2,11.6,15.2,17.7,17,14.1,9.6999999999999993,4.8,1.4,null,4,4,5,8,10,12,13,12,9,8,5,4,7.833333333333333,null,null,1.53,2.25,2.44,2.58,2.23,2.59,2.99,2.83,3.19,2.61,2.2799999999999998,1.76,2.44,600,null,null,null,null,null,null,null,"H1c"]
[39,"MORBIER (39)",46.54,"H1",850,668,551,528,430,316,188,0,0,209,330,366,593,4179,"MORBIER (39)",0.25,0.37,0.37,0.4,0.31,0.45,0.59,0.49,0.55000000000000004,0.44,0.42,0.33,null,-3.5,-1.7,1,3.7,7.8,11.7,14.3,13.1,11,7.3,1.8,-1.1000000000000001,null,4,4,5,8,10,12,13,12,9,8,5,4,7.833333333333333,{"$f":"AVERAGE(BF23:BF26)","v":8.4166666666666661},null,1.53,2.25,2.44,2.58,2.23,2.59,2.99,2.83,3.19,2.61,2.2799999999999998,1.76,2.44,600,null,23,"H2",5300,null,null,1,"H1c"]
[70,"LUXEUIL (70)",47.78,"H1",272,519,422,383,286,178,74,0,0,102,251,401,514,3130,"LUXEUIL (70)",0.91,1.62,2.87,3.98,5.08,5.58,5.48,4.5599999999999996,3.52,2.12,1,0.68,null,1,2.2999999999999998,6.6,10.3,14.2,17.399999999999999,19.3,18.899999999999999,15.8,10.5,5.6,1.9,null,5.6,6.3,8.5,10.3,12.2,13.8,14.8,14.6,13.1,10.4,7.9,6.1,10.299999999999999,null,null,1.35,1.95,2.73,2.8,2.86,2.84,2.91,2.92,3.03,2.4500000000000002,1.36,1.02,2.3516666666666666,420,null,1,"H1",4800,1.5,null,1.1000000000000001,"H1b"]
[90,"BELFORT (90)",47.38,"H1",422,541,438,395,280,177,80,0,0,105,252,406,518,3192,"BELFORT (90)",0.26,0.41,0.38,0.43,0.51,0.49,0.54,0.52,0.43,0.36,0.16,0.19,null,0.3,1.9,5.3,8.6999999999999993,12.7,15.9,17.899999999999999,17.399999999999999,14.7,10,4.7,1.3,null,5,5,6,9,11,13,14,14,13,11,9,6,9.6666666666666661,null,null,1.54,2.42,2.48,2.71,2.87,2.73,2.89,2.96,2.68,2.2400000000000002,1.23,1.22,2.3308333333333335,390,null,1,"H1",5200,1.5,null,1,"H1b"]
[39,"DOLE (39)",null,"H2",645,503.66249999999957,438.13499999999999,346.65364274135203,204.29116260108748,117.39580365712996,51.140036374750601,28.019459799300471,31.287485481743801,88.900893565633027,210.5636385271942,347.23824020113398,486.48750000000007,{"$f":"SUM(F29:Q29)","v":2853.7753629493254},"DOLE (39)",0.83636363636363631,1.5636363636363635,2.5636363636363635,3.8454545454545457,4.5272727272727273,5.127272727272727,5.290909090909091,4.3090909090909086,3.3818181818181818,1.9545454545454544,0.96363636363636362,0.66363636363636358,null,1.2727272727272725,2.545454545454545,6.4545454545454541,9.545454545454545,13,15.909090909090908,17.727272727272727,17.363636363636363,14.636363636363637,9.8181818181818183,5.3636363636363633,2.0909090909090904,null,{"$f":"AT20/1.1","v":5.4545454545454541},{"$f":"AU20/1.1","v":6.0909090909090908},8.0909090909090899,9.6363636363636349,11.363636363636363,12.818181818181817,13.727272727272727,13.545454545454545,12.181818181818182,9.7272727272727266,7.5454545454545459,5.9090909090909083,{"$f":"AVERAGE(AT29:BE29)","v":9.6742424242424239},null,null,{"$f":"BI20/1.1","v":1.209090909090909},{"$f":"BJ20/1.1","v":1.8999999999999997},2.4,2.709090909090909,2.5363636363636362,2.5818181818181816,2.7636363636363632,2.7454545454545451,2.9272727272727272,2.2363636363636363,1.3090909090909089,1,{"$f":"AVERAGE(BI29:BT29)","v":2.1931818181818179},400,null,null,null,null,null,null,null,"H1c"]
[]
[null,null,null,null,null,null,null,null,null,null,null,{"$f":"(INDEX(E20:E29,A18))","v":{"$error":"#VALUE!"}}]
[]
[null,null,null,null,null,null,null,null,null,null,null,null,null,null,null,null,null,null,"source","http://re.jrc.ec.europa.eu/pvgis/apps4/pvest.php"]
[null,null,null,null,null,null,null,null,null,null,null,null,null,null,null,null,null,null,null,"apports solaires (kWh/j.m²/orientation)"]
[]
[null,null,null,null,null,null,null,null,null,null,null,null,null,null,null,null,null,null,{"$f":"S20","v":"DIJON (21)"},"janvier","fevrier","mars","avril","mai","juin","juillet","aout","septembre","octobre","novembre","decembre"]
[null,null,null,null,null,null,null,null,null,null,null,null,null,null,null,null,null,null,"Nord :",0.28000000000000003,0.47,0.77,0.98,1.35,1.7,1.51,1.03,0.76,0.56999999999999995,0.33,0.24]
[1,"AIN","H1","V",-10,-999,0,"01",null,"altitude",{"$f":"INDEX(A20:A29,A18)","v":{"$error":"#VALUE!"}},{"$f":"IF(K38=70,1,IF(K38=39,2,IF(K38=25,3,IF(N39=90,4,\"\"))))","v":{"$error":"#VALUE!"}},null,null,null,null,null,null,"nord Est/ouest",{"$f":"(T37+T39)/2","v":0.42499999999999999},{"$f":"(U37+U39)/2","v":0.80999999999999994},1.395,1.7949999999999999,2.0750000000000002,2.4350000000000001,2.3149999999999999,1.87,1.5,0.99,0.52500000000000002,0.375]
["02","AISNE","H1","V",-7,-999,0,"02",{"$f":"(INDEX(E20:E29,A18))","v":{"$error":"#VALUE!"}},{"$f":"SUM(O40:O52)","v":{"$error":"#VALUE!"}},70,39,25,90,null,null,null,null,"Est :",0.56999999999999995,1.1499999999999999,2.02,2.61,2.8,3.17,3.12,2.71,2.2400000000000002,1.41,0.72,0.51]
["03","ALLIER","H1","V",-8,-999,0,"03",1,200,-12,-10,-12,-15,{"$f":"IF(I39<J40,200,0)","v":{"$error":"#VALUE!"}},null,null,null,"Sud est/ouest",{"$f":"(T39+T41)/2","v":0.97499999999999987},{"$f":"(U39+U41)/2","v":1.82},2.7250000000000001,2.9550000000000001,2.7749999999999999,2.9649999999999999,2.99,2.915,2.8650000000000002,2.0949999999999998,1.2050000000000001,0.91]
["04","ALPES DE HAUTES-PROVENCE","H2","V",-8,-999,0,"04",2,400,-13,-11,-13,-15,{"$f":"IF(AND($I$39>=J40,$I$39<J41),J41,0)","v":{"$error":"#VALUE!"}},null,null,null,"Sud :",1.38,2.4900000000000002,3.43,3.3,2.75,2.76,2.86,3.12,3.49,2.78,1.69,1.31]
["05","HAUTES-ALPES","H1","V",-10,-999,0,"05",3,600,-15,-13,-15,-19,{"$f":"IF(AND($I$39>=J41,$I$39<J42),J42,0)","v":{"$error":"#VALUE!"}},null,null,null,"Ouest :",0.56999999999999995,1.1399999999999999,2.02,2.61,2.8,3.16,3.12,2.71,2.2400000000000002,1.41,0.72,0.51]
[null,null,null,null,null,null,null,null,4,null,null,null,null,null,null,null,null,null,"Horizontal",0.94,1.84,3.36,4.5599999999999996,5.12,5.87,5.77,4.8899999999999997,3.81,2.31,1.1599999999999999,0.81]
["06","ALPES-MARITIMES","H3","V",-5,-999,1,"06",5,800,-17,-14,-17,-21,{"$f":"IF(AND($I$39>=J42,$I$39<J44),J44,0)","v":{"$error":"#VALUE!"}},null,null,null,{"$f":"S21","v":"BESANCON (25)"},"janvier","fevrier","mars","avril","mai","juin","juillet","aout","septembre","octobre","novembre","decembre"]
["07","ARDÈCHE","H2","V ou W",-6,-999,0,"07",6,1000,-19,-17,-19,-23,{"$error":"#VALUE!"},null,null,null,"Nord :",0.28000000000000003,0.44,0.74,0.96,1.32,1.63,1.46,0.97,0.74,0.55000000000000004,0.33,0.24]
["08","ARDENNES","H1","V",-10,-999,0,"08",7,1200,-21,-19,-21,-24,{"$error":"#VALUE!"},null,null,null,"nord Est/ouest",{"$f":"(T45+T47)/2","v":0.44},{"$f":"(U45+U47)/2","v":0.755},1.31,1.74,2.04,2.38,2.2999999999999998,1.835,1.4900000000000002,1.0049999999999999,0.53500000000000003,0.37]
["09","ARIÈGE","H2","V",-5,-999,0,"09",8,1400,-23,-21,-23,-25,{"$error":"#VALUE!"},null,null,null,"Est :",0.6,1.07,1.88,2.52,2.76,3.13,3.14,2.7,2.2400000000000002,1.46,0.74,0.5]
["10","AUBE","H1","V",-10,-999,0,"10",9,1600,-24,-23,-24,null,{"$error":"#VALUE!"},null,null,null,"Sud est/ouest",{"$f":"(T47+T49)/2","v":1.1000000000000001},{"$f":"(U47+U49)/2","v":1.7600000000000002},2.56,2.8849999999999998,2.7349999999999999,2.9249999999999998,3,2.92,2.87,2.2050000000000001,1.335,0.96499999999999997]
["11","AUDE","H3","V ou W",-5,-999,1,"11",10,1800,null,-24,null,null,{"$error":"#VALUE!"},null,null,null,"Sud :",1.6,2.4500000000000002,3.24,3.25,2.71,2.72,2.86,3.14,3.5,2.95,1.93,1.43]
["12","AVEYRON","H2","V",-8,-999,0,"12",11,2000,null,-25,null,null,{"$error":"#VALUE!"},null,null,null,"Ouest :",0.62,1.1299999999999999,1.92,2.57,2.78,3.17,3.18,2.76,2.2599999999999998,1.48,0.78,0.52]
[null,null,null,null,null,null,null,null,12,null,null,null,null,null,null,null,null,null,"Horizontal",1,1.81,3.26,4.54,5.15,5.9,5.9,4.95,3.81,2.37,1.23,0.84]
["13","BOUCHES-DU-RHÔNE","H3","W",-5,-999,1,"13",13,2200,null,-29,null,null,{"$f":"IF(AND($I$39>=J50,$I$39<J52),J52,0)","v":{"$error":"#VALUE!"}},null,null,null,{"$f":"S22","v":"PONTARLIER (25)"},"janvier","fevrier","mars","avril","mai","juin","juillet","aout","septembre","octobre","novembre","decembre"]
["14","CALVADOS","H1","V",-7,-999,1,"14",null,null,null,null,null,null,null,null,null,null,"Nord :",0.31,0.46,0.77,1,1.32,1.59,1.42,0.98,0.76,0.56999999999999995,0.34,0.25]
["15","CANTAL","H1","V",-8,-999,0,"15",null,{"$f":"-G2+Calcul!N65","v":{"$error":"#VALUE!"}},null,null,null,null,null,null,null,null,"nord Est/ouest",{"$f":"(T53+T55)/2","v":0.495},{"$f":"(U53+U55)/2","v":0.77500000000000002},1.35,1.72,1.94,2.23,2.17,1.7549999999999999,1.4449999999999998,1.01,0.57000000000000006,0.4]
["16","CHARENTE","H2","V",-5,-999,0,"16",null,null,null,null,null,null,null,null,null,null,"Est :",0.68,1.0900000000000001,1.93,2.44,2.56,2.87,2.92,2.5299999999999998,2.13,1.45,0.8,0.55000000000000004]
["17","CHARENTE-MARITIME","H2","V",-5,-999,1,"17",null,null,null,null,null,null,null,null,null,null,"Sud est/ouest",{"$f":"(T55+T57)/2","v":1.2350000000000001},{"$f":"(U55+U57)/2","v":1.7400000000000002},2.59,2.75,2.5549999999999997,2.73,2.8149999999999999,2.7549999999999999,2.75,2.2349999999999999,1.42,1.06]
["18","CHER","H2","V",-7,-999,0,"18",null,null,null,null,null,null,null,null,null,null,"Sud :",1.79,2.39,3.25,3.06,2.5499999999999998,2.59,2.71,2.98,3.37,3.02,2.04,1.57]
["19","CORRÈZE","H1","V",-8,-999,0,"19",null,null,null,null,null,null,null,null,null,null,"Ouest :",0.71,1.1200000000000001,1.98,2.46,2.57,2.88,2.93,2.5499999999999998,2.15,1.48,0.83,0.57999999999999996]
[null,null,null,null,null,null,null,null,null,null,null,null,null,null,null,null,null,null,"Horizontal",1.1000000000000001,1.81,3.27,4.32,4.76,5.47,5.51,4.71,3.72,2.4500000000000002,1.3,0.9]
["2A","CORSE-DU-SUD","H3","V",-2,-999,1,"2A",null,null,null,null,null,null,null,null,null,null,{"$f":"S23","v":"MONTMOROT (39)"},"janvier","fevrier","mars","avril","mai","juin","juillet","aout","septembre","octobre","novembre","decembre"]
["21","CÔTE-D'OR","H1","V",-10,-999,0,"21",null,null,null,null,null,null,null,null,null,null,"Nord :",0.28999999999999998,0.46,0.74,0.95,1.31,1.63,1.43,0.97,0.73,0.56999999999999995,0.34,0.25]
["22","CÔTES D'ARMOR","H2","V",-4,-999,1,"22",null,null,null,null,null,null,null,null,null,null,"nord Est/ouest",{"$f":"(T61+T63)/2","v":0.45499999999999996},{"$f":"(U61+U63)/2","v":0.79},1.3849999999999998,1.7949999999999999,2.0649999999999999,2.4249999999999998,2.34,1.895,1.5149999999999999,1.0049999999999999,0.55500000000000005,0.4]
["23","CREUSE","H1","V",-8,-999,0,"23",null,null,null,null,null,null,null,null,null,null,"Est :",0.62,1.1200000000000001,2.0299999999999998,2.64,2.82,3.22,3.25,2.82,2.2999999999999998,1.44,0.77,0.55000000000000004]
["24","DORDOGNE","H2","V",-5,-999,0,"24",null,null,null,null,null,null,null,null,null,null,"Sud est/ouest",{"$f":"(T63+T65)/2","v":1.07},{"$f":"(U63+U65)/2","v":1.78},2.73,2.9850000000000003,2.7850000000000001,2.9850000000000003,3.08,2.9950000000000001,2.9449999999999998,2.16,1.31,1.0150000000000001]
[25,"DOUBS","H1","V",-12,-999,0,"25",null,null,null,null,null,null,null,null,null,null,"Sud :",1.52,2.44,3.43,3.33,2.75,2.75,2.91,3.17,3.59,2.88,1.85,1.48]
["26","DRÔME","H2","V ou W",-6,-999,0,"26",null,null,null,null,null,null,null,null,null,null,"Ouest :",0.6,1.1200000000000001,2.0299999999999998,2.64,2.83,3.22,3.26,2.82,2.3199999999999998,1.46,0.75,0.53]
[null,null,null,null,null,null,null,null,null,null,null,null,null,null,null,null,null,null,"Horizontal",1.01,1.83,3.37,4.6399999999999997,5.21,6.02,6.08,5.0599999999999996,3.92,2.38,1.24,0.88]
["27","EURE","H1","V",-7,-999,0,"27",null,null,null,null,null,null,null,null,null,null,{"$f":"S24","v":"CHAMPAGNOLE (39)"},"janvier","fevrier","mars","avril","mai","juin","juillet","aout","septembre","octobre","novembre","decembre"]
["28","EURE-et-LOIR","H1","V",-7,-999,0,"28",null,null,null,null,null,null,null,null,null,null,"Nord :",0.3,0.45,0.73,0.97,1.3,1.64,1.45,0.99,0.73,0.56000000000000005,0.33,0.25]
["29","FINISTÈRE","H2","V",-4,-999,1,"29",null,null,null,null,null,null,null,null,null,null,"nord Est/ouest",{"$f":"(T69+T71)/2","v":0.51},{"$f":"(U69+U71)/2","v":0.80499999999999994},1.355,1.7349999999999999,1.9950000000000001,2.37,2.3050000000000002,1.875,1.4850000000000001,1.0350000000000001,0.57999999999999996,0.42]
["30","GARD","H3","V",-5,-999,1,"30",null,null,null,null,null,null,null,null,null,null,"Est :",0.72,1.1599999999999999,1.98,2.5,2.69,3.1,3.16,2.76,2.2400000000000002,1.51,0.83,0.59]
["31","HAUTE-GARONNE","H2","V",-5,-999,0,"31",null,null,null,null,null,null,null,null,null,null,"Sud est/ouest",{"$f":"(T71+T73)/2","v":1.325},{"$f":"(U71+U73)/2","v":1.8900000000000001},2.6799999999999997,2.8200000000000003,2.67,2.89,2.9850000000000003,2.9249999999999998,2.875,2.2999999999999998,1.4750000000000001,1.1499999999999999]
["32","GERS","H2","V",-5,-999,0,"32",null,null,null,null,null,null,null,null,null,null,"Sud :",1.93,2.62,3.38,3.14,2.65,2.68,2.81,3.09,3.51,3.09,2.12,1.71]
["33","GIRONDE","H2","V",-5,-999,1,"33",null,null,null,null,null,null,null,null,null,null,"Ouest :",0.74,1.17,1.98,2.5099999999999998,2.7,3.12,3.18,2.77,2.2599999999999998,1.53,0.84,0.61]
["34","HÉRAULT","H3","V",-5,-999,1,"34",null,null,null,null,null,null,null,null,null,null,"Horizontal",1.1299999999999999,1.89,3.33,4.43,5,5.81,5.84,4.93,3.84,2.4700000000000002,1.31,0.93]
["35","ILLE-et-VILAINE","H2","V",-4,-999,1,"35",null,null,null,null,null,null,null,null,null,null,{"$f":"S25","v":"SAINT CLAUDE (39)"},"janvier","fevrier","mars","avril","mai","juin","juillet","aout","septembre","octobre","novembre","decembre"]
["36","INDRE","H2","V",-7,-999,0,"36",null,null,null,null,null,null,null,null,null,null,"Nord :",0.3,0.45,0.74,0.93,1.1499999999999999,1.36,1.2,0.89,0.74,0.56000000000000005,0.34,0.25]
["37","INDRE-et-LOIRE","H2","V",-7,-999,0,"37",null,null,null,null,null,null,null,null,null,null,"nord Est/ouest",{"$f":"(T77+T79)/2","v":0.45999999999999996},{"$f":"(U77+U79)/2","v":0.73},1.2149999999999999,1.4850000000000001,1.6099999999999999,1.8850000000000002,1.83,1.575,1.31,0.94000000000000006,0.52500000000000002,0.38500000000000001]
["38","ISÈRE","H1","V",-10,-999,0,"38",null,null,null,null,null,null,null,null,null,null,"Est :",0.62,1.01,1.69,2.04,2.0699999999999998,2.41,2.46,2.2599999999999998,1.88,1.32,0.71,0.52]
[39,"JURA","H1","V",-10,-999,0,"39",null,null,null,null,null,null,null,null,null,null,"Sud est/ouest",{"$f":"(T79+T81)/2","v":1.23},{"$f":"(U79+U81)/2","v":1.7400000000000002},2.375,2.4249999999999998,2.2649999999999997,2.48,2.5750000000000002,2.6150000000000002,2.5949999999999998,2.1350000000000002,1.345,1.03,null,null,"Month","Ed","Em","Hd","Hm"]
["40","LANDES","H2","V",-5,-999,1,"40",null,null,null,null,null,null,null,null,null,null,"Sud :",1.84,2.4700000000000002,3.06,2.81,2.46,2.5499999999999998,2.69,2.97,3.31,2.95,1.98,1.54,null,null,"n","0.75","23.2","0.97","30.2"]
["41","LOIR-et-CHER","H2","V",-7,-999,0,"41",null,null,null,null,null,null,null,null,null,null,"Ouest :",0.69,1.1200000000000001,1.84,2.21,2.41,2.8,2.84,2.48,2.08,1.46,0.79,0.52,null,null,"Feb","1.52","42.4","1.90","53.2"]
["42","LOIRE","H1","V",-10,-999,0,"42",null,null,null,null,null,null,null,null,null,null,"Horizontal",1.1399999999999999,1.86,3.16,4.04,4.55,5.36,5.44,4.6900000000000004,3.71,2.44,1.32,0.92,null,null,"Mar","2.70","83.8","3.40",105]
["43","HAUTE-LOIRE","H1","V",-8,-999,0,"43",null,null,null,null,null,null,null,null,null,null,{"$f":"S26","v":"MORBIER (39)"},"janvier","fevrier","mars","avril","mai","juin","juillet","aout","septembre","octobre","novembre","decembre",null,null,"Apr","3.61",108,"4.64",139]
["44","LOIRE-ATLANTIQUE","H2","V",-5,-999,1,"44",null,null,null,null,null,null,null,null,null,null,"Nord :",0.3,0.44,0.74,0.96,1.23,1.5,1.33,0.95,0.75,0.56000000000000005,0.34,0.25,null,null,"May","4.01",124,"5.28",164]
["45","LOIRET","H1","V",-7,-999,0,"45",null,null,null,null,null,null,null,null,null,null,"nord Est/ouest",{"$f":"(T85+T87)/2","v":0.495},{"$f":"(U85+U87)/2","v":0.745},1.22,1.56,1.79,2.1150000000000002,2.0449999999999999,1.69,1.395,0.96500000000000008,0.56000000000000005,0.41,null,null,"Jun","4.52",136,"6.06",182]
["46","LOT","H2","V",-6,-999,0,"46",null,null,null,null,null,null,null,null,null,null,"Est :",0.69,1.05,1.7,2.16,2.35,2.73,2.76,2.4300000000000002,2.04,1.37,0.78,0.56999999999999995,null,null,"Jul","4.46",138,"6.00",186]
["47","LOT-et-GARONNE","H2","V",-5,-999,0,"47",null,null,null,null,null,null,null,null,null,null,"Sud est/ouest",{"$f":"(T87+T89)/2","v":1.3199999999999998},{"$f":"(U87+U89)/2","v":1.77},2.39,2.4900000000000002,2.4050000000000002,2.625,2.7,2.68,2.6850000000000001,2.1800000000000002,1.4249999999999998,1.1199999999999999,null,null,"Aug","3.78",117,"5.05",156]
["48","LOZÈRE","H2","V",-8,-999,0,"48",null,null,null,null,null,null,null,null,null,null,"Sud :",1.95,2.4900000000000002,3.08,2.82,2.46,2.52,2.64,2.93,3.33,2.99,2.0699999999999998,1.67,null,null,"Sep","2.98","89.5","3.91",117]
["49","MAINE-et-LOIRE","H2","V",-7,-999,0,"49",null,null,null,null,null,null,null,null,null,null,"Ouest :",0.76,1.1399999999999999,1.85,2.2400000000000002,2.4300000000000002,2.77,2.84,2.52,2.14,1.48,0.84,0.6,null,null,"Oct","1.86","57.6","2.42","74.9"]
["50","MANCHE","H2","V",-4,-999,1,"50",null,null,null,null,null,null,null,null,null,null,"Horizontal",1.1499999999999999,1.85,3.16,4.05,4.5999999999999996,5.35,5.4,4.67,3.72,2.4500000000000002,1.32,0.93,null,null,"Nov","0.93","27.9","1.21","36.4"]
["51","MARNE","H1","V",-10,-999,0,"51",null,null,null,null,null,null,null,null,null,null,{"$f":"S27","v":"LUXEUIL (70)"},"janvier","fevrier","mars","avril","mai","juin","juillet","aout","septembre","octobre","novembre","decembre",null,null,"Dec","0.62","19.1","0.82","25.5"]
["52","HAUTE-MARNE","H1","V",-12,-999,0,"52",null,null,null,null,null,null,null,null,null,null,"Nord :",0.26,0.44,0.74,0.97,1.34,1.68,1.51,1.02,0.76,0.55000000000000004,0.31,0.22]
["53","MAYENNE","H2","V",-7,-999,0,"53",null,null,null,null,null,null,null,null,null,null,"nord Est/ouest",{"$f":"(T93+T95)/2","v":0.42499999999999999},{"$f":"(U93+U95)/2","v":0.76},1.33,1.7349999999999999,2.0449999999999999,2.42,2.3149999999999999,1.865,1.4649999999999999,0.95000000000000007,0.505,0.35499999999999998,null,null,{"$f":"AK81","v":"0.97"},{"$f":"AK82","v":"1.90"},{"$f":"AK83","v":"3.40"},{"$f":"AK84","v":"4.64"},{"$f":"AK85","v":"5.28"},{"$f":"AK86","v":"6.06"},{"$f":"AK87","v":"6.00"},{"$f":"AK88","v":"5.05"},{"$f":"AK89","v":"3.91"},{"$f":"AK90","v":"2.42"},{"$f":"AK91","v":"1.21"},{"$f":"AK92","v":"0.82"}]
["54","MEURTHE-et-MOSELLE","H1","V",-15,-999,0,"54",null,null,null,null,null,null,null,null,null,null,"Est :",0.59,1.08,1.92,2.5,2.75,3.16,3.12,2.71,2.17,1.35,0.7,0.49]
["55","MEUSE","H1","V",-12,-999,0,"55",null,null,null,null,null,null,null,null,null,null,"Sud est/ouest",{"$f":"(T95+T97)/2","v":1.03},{"$f":"(U95+U97)/2","v":1.71},2.5949999999999998,2.8250000000000002,2.7250000000000001,2.9649999999999999,2.9850000000000003,2.9050000000000002,2.76,2.0099999999999998,1.1850000000000001,0.91500000000000004]
["56","MORBIHAN","H2","V",-4,-999,1,"56",null,null,null,null,null,null,null,null,null,null,"Sud :",1.47,2.34,3.27,3.15,2.7,2.77,2.85,3.1,3.35,2.67,1.67,1.34]
["57","MOSELLE","H1","V",-15,-999,0,"57",null,null,null,null,null,null,null,null,null,null,"Ouest :",0.59,1.08,1.92,2.5,2.75,3.15,3.12,2.71,2.1800000000000002,1.35,0.7,0.49]
["58","NIÈVRE","H1","V",-10,-999,0,"58",null,null,null,null,null,null,null,null,null,null,"Horizontal",0.91,1.71,3.2,4.3499999999999996,5,5.84,5.69,4.8099999999999996,3.65,2.2000000000000002,1.1000000000000001,0.76]
["59","NORD","H1","V",-9,-999,0,"59",null,null,null,null,null,null,null,null,null,null,{"$f":"S28","v":"BELFORT (90)"},"janvier","fevrier","mars","avril","mai","juin","juillet","aout","septembre","octobre","novembre","decembre"]
["60","OISE","H1","V",-7,-999,0,"60",null,null,null,null,null,null,null,null,null,null,"Nord :",0.28000000000000003,0.45,0.73,0.96,1.34,1.67,1.49,1,0.75,0.56000000000000005,0.32,0.23]
["61","ORNE","H1","V",-7,-999,0,"61",null,null,null,null,null,null,null,null,null,null,"nord Est/ouest",{"$f":"(T101+T103)/2","v":0.43},{"$f":"(U101+U103)/2","v":0.76500000000000001},1.3149999999999999,1.77,2.0750000000000002,2.4299999999999997,2.33,1.89,1.4850000000000001,0.97499999999999998,0.51500000000000001,0.35499999999999998]
["62","PAS-de-CALAIS","H1","V",-9,-999,0,"62",null,null,null,null,null,null,null,null,null,null,"Est :",0.57999999999999996,1.08,1.9,2.58,2.81,3.19,3.17,2.78,2.2200000000000002,1.39,0.71,0.48]
["63","PUY-DE-DÔME","H1","V",-8,-999,0,"63",null,null,null,null,null,null,null,null,null,null,"Sud est/ouest",{"$f":"(T103+T105)/2","v":1.0149999999999999},{"$f":"(U103+U105)/2","v":1.73},2.5750000000000002,2.9249999999999998,2.7850000000000001,2.98,3.02,2.9849999999999999,2.835,2.0749999999999997,1.24,0.91]
["64","PYRÉNÉES-ATLANTIQUES","H2","V",-5,-999,1,"64",null,null,null,null,null,null,null,null,null,null,"Sud :",1.45,2.38,3.25,3.27,2.76,2.77,2.87,3.19,3.45,2.76,1.77,1.34]
["65","HAUTES-PYRÉNÉES","H2","V",-5,-999,0,"65",null,null,null,null,null,null,null,null,null,null,"Ouest :",0.61,1.1100000000000001,1.92,2.6,2.83,3.19,3.17,2.81,2.2400000000000002,1.4,0.74,0.51]
["66","PYRÉNÉES-ORIENTALES","H3","V ou W",-5,-999,1,"66",null,null,null,null,null,null,null,null,null,null,"Horizontal",0.95,1.76,3.19,4.5,5.13,5.89,5.82,4.96,3.75,2.27,1.17,0.79]
["67","BAS-RHIN","H1","V",-15,-999,0,"67",null,null,null,null,null,null,null,null,null,null,{"$f":"S29","v":"DOLE (39)"},"janvier","fevrier","mars","avril","mai","juin","juillet","aout","septembre","octobre","novembre","decembre"]
["68","HAUT-RHIN","H1","V",-15,-999,0,"68",null,null,null,null,null,null,null,null,null,null,"Nord :",0.28999999999999998,0.46,0.76,0.96,1.35,1.68,1.49,0.99,0.74,0.56999999999999995,0.33,0.24]
["69","RHÔNE","H1","V",-10,-999,0,"69",null,null,null,null,null,null,null,null,null,null,"nord Est/ouest",{"$f":"(T109+T111)/2","v":0.44499999999999995},{"$f":"(U109+U111)/2","v":0.83},1.4049999999999998,1.81,2.125,2.4750000000000001,2.3650000000000002,1.9,1.5299999999999998,1.03,0.54500000000000004,0.38]
[70,"HAUTE-SAÔNE","H1","V",-12,-999,0,"70",null,null,null,null,null,null,null,null,null,null,"Est :",0.6,1.2,2.0499999999999998,2.66,2.9,3.27,3.24,2.81,2.3199999999999998,1.49,0.76,0.52]
["71","SAÔNE-ET-LOIRE","H1","V",-10,-999,0,"71",null,null,null,null,null,null,null,null,null,null,"Sud est/ouest",{"$f":"(T111+T113)/2","v":1.0349999999999999},{"$f":"(U111+U113)/2","v":1.92},2.7649999999999997,3.0049999999999999,2.855,3.0350000000000001,3.08,3.01,2.9649999999999999,2.2400000000000002,1.2949999999999999,0.93500000000000005]
["72","SARTHE","H2","V",-7,-999,0,"72",null,null,null,null,null,null,null,null,null,null,"Sud :",1.47,2.64,3.48,3.35,2.81,2.8,2.92,3.21,3.61,2.99,1.83,1.35]
["73","SAVOIE","H1","V",-10,-999,0,"73",null,null,null,null,null,null,null,null,null,null,"Ouest :",0.6,1.18,2.0499999999999998,2.66,2.9,3.26,3.24,2.81,2.3199999999999998,1.49,0.76,0.52]
["74","HAUTE-SAVOIE","H1","V",-10,-999,0,"74",null,null,null,null,null,null,null,null,null,null,"Horizontal",0.97,1.9,3.4,4.6399999999999997,5.28,6.06,6,5.05,3.91,2.42,1.21,0.82]
["75","PARIS","H1","V",-5,-999,0,"75",null,null,null,null,null,null,null,null,null,null,{"$f":"INDEX(B20:B29,A18,1)","v":{"$error":"#VALUE!"}},"janvier","fevrier","mars","avril","mai","juin","juillet","aout","septembre","octobre","novembre","decembre"]
["76","SEINE-MARITIME","H1","V",-7,-999,1,"76",null,null,null,null,null,null,null,null,null,{"$f":"MATCH(S116,S36:S114,0)","v":{"$error":"#VALUE!"}},"Nord :",{"$f":"OFFSET($S$36,$R117,T$124)","v":{"$error":"#VALUE!"}},{"$error":"#VALUE!"},{"$error":"#VALUE!"},{"$error":"#VALUE!"},{"$error":"#VALUE!"},{"$error":"#VALUE!"},{"$error":"#VALUE!"},{"$error":"#VALUE!"},{"$error":"#VALUE!"},{"$error":"#VALUE!"},{"$error":"#VALUE!"},{"$error":"#VALUE!"}]
["77","SEINE-et-MARNE","H1","V",-7,-999,0,"77",null,null,null,null,null,null,null,null,null,{"$f":"R117+1","v":{"$error":"#VALUE!"}},"nord Est/ouest",{"$error":"#VALUE!"},{"$error":"#VALUE!"},{"$error":"#VALUE!"},{"$error":"#VALUE!"},{"$error":"#VALUE!"},{"$error":"#VALUE!"},{"$error":"#VALUE!"},{"$error":"#VALUE!"},{"$error":"#VALUE!"},{"$error":"#VALUE!"},{"$error":"#VALUE!"},{"$error":"#VALUE!"}]
["78","YVELINES","H1","V",-7,-999,0,"78",null,null,null,null,null,null,null,null,null,{"$error":"#VALUE!"},"Est :",{"$error":"#VALUE!"},{"$error":"#VALUE!"},{"$error":"#VALUE!"},{"$error":"#VALUE!"},{"$error":"#VALUE!"},{"$error":"#VALUE!"},{"$error":"#VALUE!"},{"$error":"#VALUE!"},{"$error":"#VALUE!"},{"$error":"#VALUE!"},{"$error":"#VALUE!"},{"$error":"#VALUE!"}]
["79","DEUX-SÈVRES","H2","V",-7,-999,0,"79",null,null,null,null,null,null,null,null,null,{"$error":"#VALUE!"},"Sud est/ouest",{"$error":"#VALUE!"},{"$error":"#VALUE!"},{"$error":"#VALUE!"},{"$error":"#VALUE!"},{"$error":"#VALUE!"},{"$error":"#VALUE!"},{"$error":"#VALUE!"},{"$error":"#VALUE!"},{"$error":"#VALUE!"},{"$error":"#VALUE!"},{"$error":"#VALUE!"},{"$error":"#VALUE!"}]
["80","SOMME","H1","V",-9,-999,0,"80",null,null,null,null,null,null,null,null,null,{"$error":"#VALUE!"},"Sud :",{"$error":"#VALUE!"},{"$error":"#VALUE!"},{"$error":"#VALUE!"},{"$error":"#VALUE!"},{"$error":"#VALUE!"},{"$error":"#VALUE!"},{"$error":"#VALUE!"},{"$error":"#VALUE!"},{"$error":"#VALUE!"},{"$error":"#VALUE!"},{"$error":"#VALUE!"},{"$error":"#VALUE!"}]
["81","TARN","H2","V",-5,-999,0,"81",null,null,null,null,null,null,null,null,null,{"$error":"#VALUE!"},"Ouest :",{"$error":"#VALUE!"},{"$error":"#VALUE!"},{"$error":"#VALUE!"},{"$error":"#VALUE!"},{"$error":"#VALUE!"},{"$error":"#VALUE!"},{"$error":"#VALUE!"},{"$error":"#VALUE!"},{"$error":"#VALUE!"},{"$error":"#VALUE!"},{"$error":"#VALUE!"},{"$error":"#VALUE!"}]
["82","TARN-et-GARONNE","H2","V",-5,-999,0,"82",null,null,null,null,null,null,null,null,null,{"$error":"#VALUE!"},"Horizontal",{"$f":"OFFSET($S$36,$R123,T$124)","v":{"$error":"#VALUE!"}},{"$f":"OFFSET($S$36,$R123,U$124)","v":{"$error":"#VALUE!"}},{"$f":"OFFSET($S$36,$R123,V$124)","v":{"$error":"#VALUE!"}},{"$error":"#VALUE!"},{"$error":"#VALUE!"},{"$error":"#VALUE!"},{"$error":"#VALUE!"},{"$error":"#VALUE!"},{"$error":"#VALUE!"},{"$error":"#VALUE!"},{"$error":"#VALUE!"},{"$error":"#VALUE!"}]
["83","VAR","H3","V ou W",-5,-999,1,"83",null,null,null,null,null,null,null,null,null,null,null,1,2,3,4,5,6,7,8,9,10,11,12]
["84","VAUCLUSE","H2","W",-6,-999,0,"84"]
["85","VENDÉE","H2","V",-5,-999,1,"85"]
["86","VIENNE","H2","V",-7,-999,0,"86"]
["87","HAUTE-VIENNE","H1","V",-8,-999,0,"87"]
["88","VOSGES","H1","V",-15,-999,0,"88"]
["89","YONNE","H1","V",-10,-999,0,"89"]
[90,"TERRITOIRE-de-BELFORT","H1","V",-15,-999,0,"90"]
["91","ESSONNE","H1","V",-7,-999,0,"91"]
["92","HAUTS-de-SEINE","H1","V",-7,-999,0,"92"]
["93","SEINE-SAINT-DENIS","H1","V",-7,-999,0,"93"]
["94","VAL-de-MARNE","H1","V",-7,-999,0,"94"]
["95","VAL-d'OISE","H1","V",-7,-999,0,"95"]

{"sheet":"aide","index":12,"n_rows":110,"n_cols":2,"rows_kept":110,"cut":false,"hidden":true,"merged":[[72,1,72,11],[69,1,69,11],[68,1,68,11],[67,1,67,11],[58,1,58,11],[62,1,62,4],[64,1,64,4],[100,1,100,11],[96,1,96,11],[95,1,95,11],[94,1,94,11],[92,1,92,11],[89,1,89,11],[86,1,86,11],[82,1,82,11],[80,1,80,11],[81,1,81,11],[84,1,84,11],[79,1,79,11],[78,1,78,11],[77,1,77,11],[74,1,74,11],[73,1,73,11],[76,1,76,4],[23,1,23,11],[8,1,8,11],[9,1,9,11],[10,1,10,11],[13,1,13,11],[18,1,18,4],[4,1,4,11],[3,1,3,11],[5,1,5,11],[20,1,20,4],[22,1,22,4],[6,1,6,11],[15,1,15,11],[16,1,16,11],[21,1,21,11],[26,1,26,4],[32,1,32,4],[30,1,30,4],[27,1,27,11],[28,1,28,11],[29,1,29,11],[31,1,31,11],[34,1,34,4],[33,1,33,11],[39,1,39,4],[36,1,36,4],[38,1,38,4],[35,1,35,11],[37,1,37,11],[42,1,42,4],[52,1,52,4],[43,1,43,11],[50,1,50,11],[44,1,44,11],[45,1,45,11],[46,1,46,11],[48,1,48,11],[49,1,49,11],[47,1,47,10],[56,1,56,4],[57,1,57,4],[1,1,1,4],[103,1,103,4],[106,1,106,4],[93,1,93,4],[88,1,88,4],[91,1,91,4],[65,1,65,4],[97,1,97,4],[98,1,98,4],[99,1,99,4],[102,1,102,4],[105,1,105,4],[40,1,40,11],[41,1,41,11],[24,1,24,4],[25,1,25,10],[113,1,113,4],[53,1,53,4],[60,1,60,4],[63,1,63,4],[66,1,66,4],[111,1,111,4],[112,1,112,4],[61,1,61,4],[109,1,109,4],[110,1,110,4],[108,1,108,4],[71,1,71,4],[54,1,54,4],[55,1,55,4]]}
[]
[null,"Notice d'utilisation de l'outil d'estimation des consommations énergétiques initiales des logements francs-comtois"]
[]
[null,"Cet outil est un tableur interactif conçu par le bureau d'études thermiques B2EC et l'association Ajena. Il permet d'estimer rapidement la consommation initiale d’énergie finale/primaire des 5 usages de la réglementation thermique d’un logement ou d’une maison individuelle. Sans audit énergétique préalable, il est possible d'obtenir un premier niveau d'information sur la performance thermique de n'importe quel logement, dressant ainsi leur \"photographie énergétique\" initiale. Les préconisations de travaux d'amélioration qui pourront être envisagés par la suite découleront de la prise en compte de cet état initial et pourront être ainsi optimisées."]
[null,"Il existe de nombreux calculateurs en ligne sur Internet proposant plus ou moins la même chose, toutefois cet outil est bien plus adapté à la situation climatique de la Franche-Comté car contrairement aux autres simulateurs, son mode de calcul est basé sur une méthode mensuelle, rapportée au DJU[1] de la zone à étudier. De plus, il offre la possibilité de paramétrer finement certaines hypothèses de calcul, comme le nombre de personnes vivant dans le logement et les températures de consigne et réduits pour le chauffage et l'eau chaude sanitaire. Les résultats obtenus peuvent ainsi se rapprocher des consommations réelles d’un logement."]
[null,"Deux types de saisies sont possibles, saisie simplifiée et saisie \"pro\", pour deux utilisations différentes. Chacune permet toutefois d'obtenir une première estimation des consommations énergétiques, une présentation de la répartition des déperditions et des consommations, une estimation du niveau d'isolation du logement grâce à sa valeur Ubât[2], l'étiquette énergie correspondante et la valeur d'émission de gaz à effet de serre, ainsi qu'un tableau de synthèse présentant les différents postes de consommations et leurs coûts."]
[null,"La première apporte une première estimation sommaire que le particulier peut faire lui-même, la seconde, destinée aux professionnels permet de se dégager du calcul théorique réglementaire et d'avoir une estimation plus fine et plus en lien avec la réalité des factures. Dans cette deuxième utilisation, il convient de connaître au préalable les surfaces de toutes les parois déperditivives et leurs coefficients U. Un bureau d'études thermiques ayant réalisé un audit énergétique sur la base de la méthode de calcul TH-C-E ex pourra ainsi affiner son analyse et se rapprocher de l'utilisation réelle du logement."]
[]
[null,"[1] DJU : Degrés-Jour Unifiés sont calculés à partir de relevés de températures extérieures établies par Météo France sous forme de base de données annuelle ou trentenaire généralement sur une base de 18°C (d'où l'appellation DJU-base 18)."]
[null,"Les DJU sont additionnés sur une période de chauffage de 232 jours (du 1er Octobre au 20 Mai), pour chaque jour, le nombre de DJU est calculé en faisant la différence entre une température de référence 18°C et la moyenne des températures minimales et maximales du jour en question, les DJU sont additionnés jour par jour, par mois et par année, ce qui permet un calcul très fin pour déterminer les besoins de chauffage d'un bâtiment d'une zone climatique donnée."]
[null,"[2] Ubât : Les déperditions théoriques d’un bâtiment par transmission à travers les parois, les baies et les ponts thermiques sont caractérisées par le coefficient moyen de déperdition appelé Ubât, exprimé en W/m².K et déterminé par la méthode de calcul TH-C-E. Plus un Ubât est faible et plus le bâtiment est performant."]
[]
[]
[null,"Saisie simplifiée"]
[]
[null,"Cette saisie peut être renseignée directement par l'usager. 10 questions concernant l'enveloppe bâtie et 9 questions concernant les systèmes présents dans le logement (chauffage, production d'eau chaude sanitaire et ventilation) suffisent pour obtenir des résultats chiffrés et des graphiques pédagogiques "]
[null,"Les questions posées balayent les principaux éléments ayant un réel impact sur le calcul des consommations énergétiques d'un bâtiment."]
[]
[null,"Données techniques bâtiment"]
[]
[null,"1. Typologie (menu déroulant)"]
[null,"C'est l'année de construction qui a été choisie pour caractériser les logements. Les valeurs correspondantes ont été définies à partir de l'étude d'un échantillon représentatif de chaque typologie."]
[null,"2.   Nombre d'étage"]
[null,"Il suffit de cliquer sur le pictogramme adéquat. Pour un logement comprenant un simple \nRDC , le chiffre 1 apparaitra dans la case de droite, pour un RDC+ niveau sous combles aménagés: 1,5 alors que pour deux niveaux complets + combles perdus non aménagés : 2. Le dernier cas de figure est un logement sur 2 niveaux + un niveau sous combles aménagés pour lequel on indiquera une valeur de 2,5. Pour les logements de plus de 2,5 niveaux, indiquer simplement le nombre de niveaux dans la case, ne pas se soucier du dessin."]
[null,"3.   Nombre de logements"]
[null,"Indiquer le nombre le logements contenus dans le bâtiment étudié"]
[null,"4.   Surface et type de logement"]
[null,"La surface la plus importante à renseigner est la surface habitable qui est facilement calculable. Des aides en ligne sur internet existent pour ce calcul. La SRT sera calculée automatiquement si elle n'est pas connue."]
[null,"5.   Ville (menu déroulant)"]
[null,"Un menu déroulant permet de choisir la ville la plus proche de son lieu de résidence ou bien celle dont les conditions climatiques sont les plus similaires. Les 4 départements de la Franche-Comté sont couverts.."]
[null,"6.   Mitoyenneté (menu déroulant)"]
[null,"Un menu déroulant permet de choisir parmi les différents cas de figures selon si le logement est mitoyen ou non. "]
[null,"7.   Hauteur moyenne sous plafond"]
[null,"Les hauteurs sous plafond à l'intérieur d'un logement peuvent être différentes d'une pièce à l'autre, il conviendra d'établir une moyenne. Renseigner cette hauteur en mètres."]
[null,"8.   Forme de l'emprise du bâtiment (menu déroulant)"]
[null,"Les pictogrammes et le menu déroulant permettent de choisir la forme la plus proche du bâtiment à tester."]
[null,"9.   Nombre d'occupants du logement"]
[null,"Il convient de renseigner le nombre d'occupants réguliers dans le logement sur une année."]
[null,"10.   Type d'isolation (menu déroulant)"]
[null,"2 choix sont possibles :"]
[null,"‒        Mauvaise isolation : cas d'un logement non isolé ou très partiellement avec des niveaux de performance très bas (quelques cm d'isolant ancien par                          exemple)"]
[null,"‒         Isolation moyenne : cas d'un logement déjà entièrement isolé mais avec un niveau de performance bas (épaisseurs faibles, pose ne prenant pas en compte l'étanchéité à l'air et les ponts thermiques..) ou cas d'un logement partiellement isolé avec un niveau de performance moyen à bon. (cas d'un logement ou seuls les combles ont été refaits avec 30cm d'isolant, ou d'un logement ou seuls les murs ont été isolés par l'extérieur..)"]
[null,"11.   Type de plancher et plafond (menu déroulant)"]
[null,"Pour les planchers bas : 3 propositions possibles mais un seul choix (en cas de plusieurs sortes de planchers bas, prendre le cas le plus représentatif)"]
[null,"‒        sur terre-plein"]
[null,"‒        sur vide sanitaire (à choisir aussi pour les planchers donnant sur l'extérieur ou cave ou garage ou autres locaux non chauffés)"]
[null,"‒        sans plancher bas (à choisir pour les appartements mitoyens se trouvant au-dessus d'un autre appartement)"]
[null,"Pour les plafonds : 3 propositions possibles mais un seul choix (en cas de plusieurs sortes de planchers hauts, prendre le cas le plus représentatif)"]
[null,"‒        combles perdus (plancher des combles non aménagés)"]
[null,"‒        sous rampants (parois intérieures du toit en cas de combles aménagés)"]
[null,"‒        sans plancher haut (cas des appartements mitoyens se trouvant en dessous d'un autre appartement)"]
[]
[null,"Données techniques systèmes"]
[null,"1. Chauffage principal"]
[null,"Type de chaudière et d'énergie "]
[null,"Type d'émission "]
[null,"Type d'énergie utilisée"]
[null,"Ancienneté du système"]
[null,"Isolation de la distribution : par calorifugeage on entend une protection thermique efficace des conduits de distribution entre la production de chauffage et les emetteurs lorsque la chaudière est placée hors volume chauffé. (quelques cm de laine de verre entourés de bandes plâtrées ne constituent pas un réel calorifugeage des conduits) "]
[]
[null,"2. Chauffage d'appoint"]
[null,"Choix du type de système "]
[null,"Ancienneté du système"]
[null,"3. Eau Chaude Sanitaire (ECS)"]
[null,"Choix du système"]
[null,"Ancienneté du système"]
[null,"4. Ventilation"]
[null,"Degré d'étanchéité à l'air : En l'absence de test d'étanchéité à l'air ou d'appréciation des défauts existants, il convient de choisir la case \"mauvaise étanchéité à l'air\"."]
[null,"Choix du système de ventilation"]
[null,"En cas de doute sur le système existant ou si celui-ci est hors service choisir l'option \"ventilation par ouverture des fenêtres\"."]
[]
[null,"Réglages supplémentaires "]
[null,"Ce bouton permet de renseigner certains paramètres manuellement si nécessaire."]
[null,"Cela peut-être intéressant pour déterminer si le ballon d'eau chaude sanitaire est en volume chauffé ou non, donner des valeurs connues comme la consigne de température du ballon ou de la chaudière ainsi que le taux de couverture du chauffage d'appoint. (si vous utilisez un poêle à bois occasionnellement ; saisissez entre 5 et 10%). "]
[null,"Si ces informations  ne sont pas renseignées, ce sont les valeurs par défaut de la colonne de droite qui seront prises en compte pour le calcul."]
[]
[null,"Résultats"]
[null,"En cliquant sur le bouton \"résultat\", une fenêtre \"pop-up\" s'ouvre affichant les résultats du calcul des consommations selon les 5 usages de la RT2005, en énergie primaire et finale, en euros et en émissions de C0² en fonction de la source d'énergie utilisée."]
[null,"Le bouton-image \"consommations\" affiche la répartition des consommations énergétiques.\nLe bouton-image \"déperditions\" affiche un graphique de répartition par poste des déperditions du bâti\nLe bouton-image \"Apport/Consommations\" affiche un diagramme présentant la répartition mensuelle des besoins de chauffage, des apports solaires totaux du bâtiment (prenant en compte les masques et l'orientation des menuiseries, et la température mensuelle moyenne)"]
[null,"Le bouton \"étiquette\" présente le diagramme de la consommation en énergie primaire et émission de gaz à effet de serre."]
[null,"Le bouton \"résultats\" renvoie au premier tableau"]
[null,"Il faut toujours revenir à la page d'accueil pour procéder à une saisie \"pro\"."]
[null,"Une fois en mode saisie pro, le résultat des calculs (affiché par le bouton \"résultats\") prendra en compte uniquement les saisies de ce mode. Pour afficher le résultat d’un calcul simplifié, il faudra repasser par l’accueil et revenir en mode simplifié avant d’afficher les résultats."]
[]
[null,"Saisie Pro"]
[]
[null,"\nCette saisie, plus fine, permet d'estimer plus justement les besoins et consommations d'un bâtiment, et de valider le gain énergétique du remplacement d'un système, ou de l'ajout d'isolants. La version actuelle de l'outil ne permet pas la saisie directe de variantes, mais on peut modifier les saisies et comparer les résultats afin de vérifier le gain réel en kWh et en euros, d'une hypothèse de travaux, une fois les consommations initiales du logement plus ou moins calées sur les consommations réelles. Cette saisie est plus complexe puisqu'il faudra passer par des étapes complémentaires, permettant de renseigner précisément les surfaces déperditives du bâtiment, ses ponts thermiques, les compositions des parois.. \nUne aide contextuelle est disponible dans les pages, en cliquant sur les boutons-images \"?\", ou en survolant les cellules disposant d'un petit signet rouge en haut à droite de la case, indiquant la disponibilité d'un commentaire.\n"]
[]
[null,"Données techniques bâtiment"]
[null,"La première page de la saisie est identique à la saisie simplifiée mais ne comporte que 9 questions. Celles concernant l'isolation et le type de plancher ne sont pas nécessaires. Les éléments d'informations complémentaires seront  à renseigner  dans l'onglet \"Saisie des parois\". \nVous avez la possibilité de faire une simulation pour un immeuble de logements collectifs. Il suffit de choisir l'entrée correspondante dans le premier menu et d'indiquer le nombre de logements de l'immeuble étudié.Le nombre d'étage, la SHON et la SHAB à renseigner sont ceux de l'immeuble tout entier. La hauteur moyenne sous plafond sera bien celle d'un logement, et le type de logement sera pour le moment une moyenne des types de logements du bâtiment, ou celui largement représenté (cette saisie sera améliorée par une prochaine mise à jour de l'outil)."]
[]
[null,"Saisie des parois"]
[null,"Il faut connaître les valeurs U des parois opaques, Uw  des fenêtres et Ud des portes ainsi que les surfaces en m² des parois concernées. Un outil d'aide au calcul du U d'une paroi est disponible à droite de la page. Chaque bouton envoie sur une version différente de l'outil. Cet outil garde en mémoire le dernier calcul effectué, afin de pouvoir s'y référer par la suite, au besoin. 5 \"mémoires\" sont ainsi disponibles. Dans cet utilitaire il faut commencer par renseigner la résistance surfacique coté extérieur en fonction du type de paroi étudié (données à choisir dans une liste déroulante), puis couche par couche, en partant de l'extérieur, renseigner d'abord le type de matériau de la couche, pour ensuite affiner sa nature exacte depuis la liste déroulante. Cette version du classeur ne permet pas encore la saisie de matériaux personnalisés dans la bibliothèque existante. On termine par la résistance surfacique intérieure, que l'on sélectionne également depuis la liste. Les épaisseurs de chaque couche sont à renseigner en cm. A droite se calcule au fur et à mesure le R de chaque couche, le R total de la paroi, ainsi que son U. Une fois le U calculé, on reporte cette valeur dans la page de saisies."]
[null,"La colonne orientation permet de caractériser chaque paroi"]
[null,"La variable Tau  (b) permet de caractériser un mur qui ne donnerait pas directement sur l'extérieur, mais sur un espace tampon non chauffé. Une aide contextuelle permet de donner des cas généraux, il est également possible de le calculer à l'aide de l'outil situé à droite de la fenêtre, à partir des températures mesurées dans les locaux. On peut imaginer par exemple qu'un vide sanitaire dans lequel la température ne descend jamais sous les 0 degrés, tandis que la température du logement est par défaut prise égale à la température de consigne saisie dans les réglages supplémentaires. Cette valeur peut être modifiée. Il en est de même pour la température extérieure de base, issue de la zone géographique de la ville du projet."]
[null,"Les masque solaires \nLes masque solaires permettent de prendre en compte un ombrage provoqué par une autre partie du bâtiment, un autre bâtiment, la végétation proche, ou la ligne d'horizon. Une aide contextuelle est disponible pour estimer cette valeur. "]
[null,"Les ponts thermiques sont à saisir en bas de page. Seul les linéiques de type L8- L9 - L10 entrent en compte dans le calcul du Ubât. Néanmoins, les autres ponts thermiques sont pris en compte dans le calcul des consommations, et sont donc à renseigner également. Un tableau est disponible en cliquant sur le bouton d'aide, issu du travail du bureau d'études Pouget Consultants."]
[null,"L8 : Liaison mur/plancher bas"]
[null,"L9 : Liaison mur/ plancher intermédiaire"]
[null,"L10 : Liaison mur/plancher haut lourd"]
[null,"L'inertie permet de limiter le besoin de chauffage mais induit des consommations supplémentaires à la relance. Elle est à renseigner dans le menu de droite. Une aide est disponible pour sa sélection."]
[]
[null,"Données techniques systèmes"]
[null,"idem saisie simplifiée"]
[]
[null,"Réglages supplémentaires "]
[null,"idem saisie simplifiée"]
[]
[null,"Résultats"]
[null,"idem saisie simplifiée"]

{"sheet":"Ubat","index":13,"n_rows":45,"n_cols":10,"rows_kept":45,"cut":false,"hidden":true,"merged":[[0,0,0,6],[13,0,13,6],[6,1,6,4],[7,1,7,4],[8,1,8,4],[9,1,9,4],[10,1,10,4],[1,1,1,4],[2,1,2,4],[3,1,3,4],[4,1,4,4],[5,1,5,4],[32,3,32,4],[33,3,33,4],[34,3,34,4],[31,1,31,2],[32,1,32,2],[33,1,33,2],[34,1,34,2],[31,3,31,4],[27,1,27,2],[28,1,28,2],[29,1,29,2],[30,1,30,2],[22,1,22,4],[23,1,23,4],[27,3,27,4],[28,3,28,4],[29,3,29,4],[30,3,30,4],[14,1,14,4],[15,1,15,4],[16,1,16,4],[17,1,17,4],[25,0,26,0],[25,1,25,2],[25,3,25,4],[18,1,18,4],[19,1,19,4],[20,1,20,4],[21,1,21,4]]}
[]
["A1","Surface des parois opaques verticales (hors A5, A6, A7)",null,null,null,null,"m²",{"$f":"IF('surface auto'!AA18<>0,'surface auto'!Y9,'surface auto'!AG8)","v":{"$error":"#VALUE!"}},{"$f":"IF(Chauffage!H20=0,'surface auto'!AA9,'surface auto'!AH8)","v":0},{"$f":"IF(Chauffage!H20=0,'surface auto'!AD5,'surface auto'!AI24)","v":0}]
["A2","Surface des planchers hauts et toitures (hors A3)",null,null,null,{"$f":"IF(Chauffage!H20=0,'surface auto'!AC9,'surface auto'!AK5)","v":0},"m²",{"$f":"F2-H2","v":{"$error":"#VALUE!"}},{"$f":"IF(Chauffage!H20=0,'surface auto'!AD9,'surface auto'!AM5)","v":0}]
["A3","Surface des planchers hauts donnant sur l'extérieur en béton ou en maçonnerie pour tout bâtiment, et surface des planchers haut à base de tôles métalliques nervurés des bâtiments non résidentiel",null,null,null,0,"m²",null,0,"Dperditions totales des murs"]
["A4","Surface des planchers bas",null,null,null,null,"m²",null,{"$f":"IF(Chauffage!H20=0,'surface auto'!AD13,'surface auto'!AM16)","v":0},{"$f":"J2+I2","v":0}]
["A5","Surface des portes, exception faite des portes entièrement vitrées",null,null,null,{"$f":"IF(Chauffage!H20=0,'surface auto'!AC17,'surface auto'!AF20)","v":0},"m²",null,{"$f":"IF(Chauffage!H20=0,'surface auto'!AD17,'surface auto'!AH20)","v":0}]
["A6","Surface des fenêtres, des portes entièrement vitrées, des portes-fenêtres et des parois transparentes ou translucides des bâtiments non résidentielles ",null,null,null,0,"m²",null,0]
["A7","Surface des fenêtres, des portes entièrement vitrées, des portes-fenêtres et des parois transparentes ou translucides des bâtiments résidentielles ",null,null,null,{"$f":"IF(Chauffage!H20=0,'surface auto'!Y17,'surface auto'!AH15)","v":0},"m²",null,{"$f":"IF(Chauffage!H20=0,'surface auto'!AA17,'surface auto'!AJ15)","v":0}]
["L8","Linéaire de la liaison périphérique des planchers bas avec mur",null,null,null,{"$f":"'Pont thermique'!C30","v":0},"m",null,{"$f":"'Pont thermique'!E34","v":0}]
["L9","Linéaire de la liaison périphérique des planchers intermédiaires ou sous comble aménageable avec un mur",null,null,null,{"$f":"'Pont thermique'!D30","v":0},"m"]
["L10","Linéaire de la laison périphérique avec un mur  des planchers hauts en béton, en maçonnerie ou à base de tôles métalliques nervurées",null,null,null,{"$f":"'Pont thermique'!E30","v":0},"m"]
[]
[]
["Calcul de Ubât ref"]
["A1","Surface des parois opaques verticales (hors A5, A6, A7)",null,null,null,{"$f":"H2+IF(H3>0.5*H2,H2+0.5*H2,H3)","v":{"$error":"#VALUE!"}},"m²",{"$f":"F15*B28","v":{"$error":"#VALUE!"}}]
["A2","Surface des planchers hauts et toitures (hors A3)",null,null,null,{"$f":"F3","v":0},"m²",{"$f":"F16*B29","v":0}]
["A3","Surface des planchers hauts donnant sur l'extérieur en béton ou en maçonnerie pour tout bâtiment, et surface des planchers haut à base de tôles métalliques nervurés des bâtiments non résidentiel",null,null,null,{"$f":"F4","v":0},"m²",0]
["A4","Surface des planchers bas",null,null,null,{"$f":"F5","v":0},"m²",0]
["A5","Surface des portes, exception faite des portes entièrement vitrées",null,null,null,{"$f":"F6","v":0},"m²",0]
["A6","Surface des fenêtres, des portes entièrement vitrées, des portes-fenêtres et des parois transparentes ou translucides des bâtiments non résidentielles ",null,null,null,null,"m²",0]
["A7","Surface des fenêtres, des portes entièrement vitrées, des portes-fenêtres et des parois transparentes ou translucides des bâtiments résidentielles ",null,null,null,{"$f":"TRUNC((1/6)*Saisies!E11,2)","v":0},"m²",0]
["L8","Linéaire de la liaison périphérique des planchers bas avec mur",null,null,null,{"$f":"F9","v":0},"m",0]
["L9","Linéaire de la liaison périphérique des planchers intermédiaires ou sous comble aménageable avec un mur",null,null,null,{"$f":"F10","v":0},"m",0]
["L10","Linéaire de la laison périphérique avec un mur  des planchers hauts en béton, en maçonnerie ou à base de tôles métalliques nervurées",null,null,null,{"$f":"F11","v":0},"m",0]
[null,null,null,null,null,{"$f":"SUM(F15:F21)","v":{"$error":"#VALUE!"}},null,{"$f":"SUM(H15:H24)","v":{"$error":"#VALUE!"}}]
["Coefficient","Zones H1, H2, H3 > 800m",null,"H3 < 800 m",null,null,null,"1/6 de la surface habitable pour le bâtiment de référence"]
[null,"Individuelle","Autre","Individuelle","Autre",null,null,"Attention max 50 % de la surfaces totales des partois verticlaes en contact avec l'extérieur ou avec un local non chauffé, min 20 % pour l'hébergement ou usage sanitaire avec hébergment"]
["a1",0.36,null,0.4]
["a2",0.2,null,0.25]
["a3",0.27,null,0.27]
["a4",0.27,null,0.36]
["a5",1.5,null,1.5]
["a6",2.1,null,2.2999999999999998]
["a7",1.8,null,2.1]
["a8",0.5,null,0.5]
["a9",0.9,0.9,0.9,0.9]
["a10",0.9,0.9,0.9,0.9]
[]
["Ubat",{"$f":"IF(Chauffage!H20=0,'surface auto'!AA18,'surface auto'!AL25)","v":0}]
[]
["Ubât réf",{"$f":"H25/F25","v":{"$error":"#VALUE!"}}]
[]
["Ubât base",{"$f":"B41","v":{"$error":"#VALUE!"}}]
[]
["Ubat Max",{"$f":"B41*1.25","v":{"$error":"#VALUE!"}}]

{"sheet":"LISTE","index":14,"n_rows":162,"n_cols":1,"rows_kept":162,"cut":false,"hidden":true,"merged":[]}
[]
[]
[]
[]
[]
[]
[]
[]
[]
[]
[]
[]
[]
[]
[]
[]
[]
[]
[]
[]
[]
[]
[]
[]
[]
[]
[]
[]
[]
[]
[]
[]
[]
[]
[]
[]
[]
[]
[]
[]
[]
[]
[]
[]
[]
[]
[]
[]
[]
[]
[]
[]
[]
[]
[]
[]
[]
[]
[]
[]
[]
[]
[]
[]
[]
[]
[]
[]
[]
[]
[]
[]
[]
[]
[]
[]
[]
[]
[]
[]
[]
[]
[]
[]
[]
[]
[]
[]
[]
[]
[]
[]
[]
[]
[]
[]
[]
[]
[]
[]
[]
[]
[]
[]
[]
[]
[]
[]
[]
[]
[]
[]
[]
[]
[]
[]
[]
[]
[]
[]
[]
[]
[]
[]
[]
[]
[]
[]
[]
[]
[]
[]
[]
[]
[]
[]
[]
[]
[]
[]
[]
[0]
[8]
[2]
[2]
[2]
[2]
[0]
[0]
[0.15]
[48.6]
[0]
[0]
[0]
[0]
[0]
[0]
[1]
[0]
[0]
[1]
[0]

{"sheet":"Apports solaires","index":15,"n_rows":68,"n_cols":95,"rows_kept":68,"cut":false,"hidden":true,"merged":[[0,15,0,16],[21,0,21,2],[21,3,21,6],[0,0,0,12],[10,0,10,6],[10,9,10,10],[11,0,11,6],[12,6,19,6],[13,0,13,2],[13,3,13,5],[28,9,28,11],[29,0,29,6],[51,0,51,2],[51,3,51,6],[60,0,60,2],[60,3,60,6],[40,0,40,6],[41,0,41,6],[42,6,49,6],[43,0,43,2],[43,3,43,5],[40,8,40,14],[41,8,41,14],[42,14,49,14],[43,8,43,10],[43,11,43,13],[60,16,60,18],[60,19,60,22],[67,16,67,18],[50,8,50,14],[51,8,51,10],[51,11,51,14],[60,8,60,10],[60,11,60,14],[40,16,40,22],[41,16,41,22],[42,22,49,22],[43,16,43,18],[43,19,43,21],[50,16,50,22],[51,16,51,18],[51,19,51,22],[67,8,67,10],[67,24,67,26],[40,32,40,38],[41,32,41,38],[42,38,49,38],[43,32,43,34],[43,35,43,37],[50,32,50,38],[51,32,51,34],[51,35,51,38],[60,32,60,34],[60,35,60,38],[67,32,67,34],[50,24,50,30],[51,24,51,26],[51,27,51,30],[60,24,60,26],[60,27,60,30],[40,24,40,30],[41,24,41,30],[42,30,49,30],[43,24,43,26],[43,27,43,29],[67,40,67,42],[40,48,40,54],[41,48,41,54],[42,54,49,54],[43,48,43,50],[43,51,43,53],[50,48,50,54],[51,48,51,50],[51,51,51,54],[60,48,60,50],[60,51,60,54],[67,48,67,50],[50,40,50,46],[51,40,51,42],[51,43,51,46],[60,40,60,42],[60,43,60,46],[40,40,40,46],[41,40,41,46],[42,46,49,46],[43,40,43,42],[43,43,43,45],[67,56,67,58],[40,64,40,70],[41,64,41,70],[42,70,49,70],[43,64,43,66],[43,67,43,69],[50,64,50,70],[51,64,51,66],[51,67,51,70],[60,64,60,66],[60,67,60,70],[67,64,67,66],[50,56,50,62],[51,56,51,58],[51,59,51,62],[60,56,60,58],[60,59,60,62],[40,56,40,62],[41,56,41,62],[42,62,49,62],[43,56,43,58],[43,59,43,61],[67,72,67,74],[40,80,40,86],[41,80,41,86],[42,86,49,86],[43,80,43,82],[43,83,43,85],[50,80,50,86],[51,80,51,82],[51,83,51,86],[60,80,60,82],[60,83,60,86],[67,80,67,82],[50,72,50,78],[51,72,51,74],[51,75,51,78],[60,72,60,74],[60,75,60,78],[40,72,40,78],[41,72,41,78],[42,78,49,78],[43,72,43,74],[43,75,43,77],[67,88,67,90],[50,88,50,94],[51,88,51,90],[51,91,51,94],[60,88,60,90],[60,91,60,94],[40,88,40,94],[41,88,41,94],[42,94,49,94],[43,88,43,90],[43,91,43,93]]}
["Valeurs d'irradiation solaire journalière moyennes",null,null,null,null,null,null,null,null,null,null,null,null,"moyenne",null,"Solaire thermique"]
[null,"janvier","fevrier","mars","avril","mai","juin","juillet","aout","septembre","octobre","novembre","decembre"]
["Zone H1 Nord :",{"$f":"'Liste communes'!T117","v":{"$error":"#VALUE!"}},{"$f":"'Liste communes'!U117","v":{"$error":"#VALUE!"}},{"$f":"'Liste communes'!V117","v":{"$error":"#VALUE!"}},{"$f":"'Liste communes'!W117","v":{"$error":"#VALUE!"}},{"$f":"'Liste communes'!X117","v":{"$error":"#VALUE!"}},{"$f":"'Liste communes'!Y117","v":{"$error":"#VALUE!"}},{"$f":"'Liste communes'!Z117","v":{"$error":"#VALUE!"}},{"$f":"'Liste communes'!AA117","v":{"$error":"#VALUE!"}},{"$f":"'Liste communes'!AB117","v":{"$error":"#VALUE!"}},{"$f":"'Liste communes'!AC117","v":{"$error":"#VALUE!"}},{"$f":"'Liste communes'!AD117","v":{"$error":"#VALUE!"}},{"$f":"'Liste communes'!AE117","v":{"$error":"#VALUE!"}},"kwh/j/m²",null,"Utilisation","Inclinaison plan"]
["Nord Est/ouest",{"$f":"'Liste communes'!T118","v":{"$error":"#VALUE!"}},{"$f":"'Liste communes'!U118","v":{"$error":"#VALUE!"}},{"$f":"'Liste communes'!V118","v":{"$error":"#VALUE!"}},{"$f":"'Liste communes'!W118","v":{"$error":"#VALUE!"}},{"$f":"'Liste communes'!X118","v":{"$error":"#VALUE!"}},{"$f":"'Liste communes'!Y118","v":{"$error":"#VALUE!"}},{"$f":"'Liste communes'!Z118","v":{"$error":"#VALUE!"}},{"$f":"'Liste communes'!AA118","v":{"$error":"#VALUE!"}},{"$f":"'Liste communes'!AB118","v":{"$error":"#VALUE!"}},{"$f":"'Liste communes'!AC118","v":{"$error":"#VALUE!"}},{"$f":"'Liste communes'!AD118","v":{"$error":"#VALUE!"}},{"$f":"'Liste communes'!AE118","v":{"$error":"#VALUE!"}},null,null,"ECS",45]
["Zone H1 Est :",{"$f":"'Liste communes'!T119","v":{"$error":"#VALUE!"}},{"$f":"'Liste communes'!U119","v":{"$error":"#VALUE!"}},{"$f":"'Liste communes'!V119","v":{"$error":"#VALUE!"}},{"$f":"'Liste communes'!W119","v":{"$error":"#VALUE!"}},{"$f":"'Liste communes'!X119","v":{"$error":"#VALUE!"}},{"$f":"'Liste communes'!Y119","v":{"$error":"#VALUE!"}},{"$f":"'Liste communes'!Z119","v":{"$error":"#VALUE!"}},{"$f":"'Liste communes'!AA119","v":{"$error":"#VALUE!"}},{"$f":"'Liste communes'!AB119","v":{"$error":"#VALUE!"}},{"$f":"'Liste communes'!AC119","v":{"$error":"#VALUE!"}},{"$f":"'Liste communes'!AD119","v":{"$error":"#VALUE!"}},{"$f":"'Liste communes'!AE119","v":{"$error":"#VALUE!"}},null,null,"Chauffage",60,null,null,null,"Month","Wh","Whopt","Iopt","D/G","TD","T24h","NDD"]
["Sud est/ouest",{"$f":"'Liste communes'!T120","v":{"$error":"#VALUE!"}},{"$f":"'Liste communes'!U120","v":{"$error":"#VALUE!"}},{"$f":"'Liste communes'!V120","v":{"$error":"#VALUE!"}},{"$f":"'Liste communes'!W120","v":{"$error":"#VALUE!"}},{"$f":"'Liste communes'!X120","v":{"$error":"#VALUE!"}},{"$f":"'Liste communes'!Y120","v":{"$error":"#VALUE!"}},{"$f":"'Liste communes'!Z120","v":{"$error":"#VALUE!"}},{"$f":"'Liste communes'!AA120","v":{"$error":"#VALUE!"}},{"$f":"'Liste communes'!AB120","v":{"$error":"#VALUE!"}},{"$f":"'Liste communes'!AC120","v":{"$error":"#VALUE!"}},{"$f":"'Liste communes'!AD120","v":{"$error":"#VALUE!"}},{"$f":"'Liste communes'!AE120","v":{"$error":"#VALUE!"}},null,null,"Chauffage + ECS",60,null,null,null,"Jan",891,1310,60,"0.70","2.8","2.2",463]
["Zone H1 Sud :",{"$f":"'Liste communes'!T121","v":{"$error":"#VALUE!"}},{"$f":"'Liste communes'!U121","v":{"$error":"#VALUE!"}},{"$f":"'Liste communes'!V121","v":{"$error":"#VALUE!"}},{"$f":"'Liste communes'!W121","v":{"$error":"#VALUE!"}},{"$f":"'Liste communes'!X121","v":{"$error":"#VALUE!"}},{"$f":"'Liste communes'!Y121","v":{"$error":"#VALUE!"}},{"$f":"'Liste communes'!Z121","v":{"$error":"#VALUE!"}},{"$f":"'Liste communes'!AA121","v":{"$error":"#VALUE!"}},{"$f":"'Liste communes'!AB121","v":{"$error":"#VALUE!"}},{"$f":"'Liste communes'!AC121","v":{"$error":"#VALUE!"}},{"$f":"'Liste communes'!AD121","v":{"$error":"#VALUE!"}},{"$f":"'Liste communes'!AE121","v":{"$error":"#VALUE!"}},null,null,null,null,null,null,null,"Feb",1610,2200,54,"0.64","4.7","3.8",382]
["Zone H1 Ouest :",{"$f":"'Liste communes'!T122","v":{"$error":"#VALUE!"}},{"$f":"'Liste communes'!U122","v":{"$error":"#VALUE!"}},{"$f":"'Liste communes'!V122","v":{"$error":"#VALUE!"}},{"$f":"'Liste communes'!W122","v":{"$error":"#VALUE!"}},{"$f":"'Liste communes'!X122","v":{"$error":"#VALUE!"}},{"$f":"'Liste communes'!Y122","v":{"$error":"#VALUE!"}},{"$f":"'Liste communes'!Z122","v":{"$error":"#VALUE!"}},{"$f":"'Liste communes'!AA122","v":{"$error":"#VALUE!"}},{"$f":"'Liste communes'!AB122","v":{"$error":"#VALUE!"}},{"$f":"'Liste communes'!AC122","v":{"$error":"#VALUE!"}},{"$f":"'Liste communes'!AD122","v":{"$error":"#VALUE!"}},{"$f":"'Liste communes'!AE122","v":{"$error":"#VALUE!"}},null,null,null,null,null,null,null,"Mar",2770,3420,44,"0.57","8.4","7.1",298]
["horizontal",{"$f":"'Liste communes'!T123","v":{"$error":"#VALUE!"}},{"$f":"'Liste communes'!U123","v":{"$error":"#VALUE!"}},{"$f":"'Liste communes'!V123","v":{"$error":"#VALUE!"}},{"$f":"'Liste communes'!W123","v":{"$error":"#VALUE!"}},{"$f":"'Liste communes'!X123","v":{"$error":"#VALUE!"}},{"$f":"'Liste communes'!Y123","v":{"$error":"#VALUE!"}},{"$f":"'Liste communes'!Z123","v":{"$error":"#VALUE!"}},{"$f":"'Liste communes'!AA123","v":{"$error":"#VALUE!"}},{"$f":"'Liste communes'!AB123","v":{"$error":"#VALUE!"}},{"$f":"'Liste communes'!AC123","v":{"$error":"#VALUE!"}},{"$f":"'Liste communes'!AD123","v":{"$error":"#VALUE!"}},{"$f":"'Liste communes'!AE123","v":{"$error":"#VALUE!"}},null,null,null,null,null,null,null,"Apr",3990,4390,30,"0.54","11.4","10.0",176]
[null,null,null,null,null,null,null,null,null,null,null,null,null,null,null,null,null,null,null,null,"May",4850,4860,17,"0.55","16.0","14.7",65]
["Apports solaires (QS)",null,null,null,null,null,null,null,null,null,null,null,null,"Simple vitrage ou sur-vitrage",0.6,null,null,null,null,null,"Jun",5530,5360,13,"0.52","19.7","18.2",19]
[null,null,null,null,null,null,null,null,null,null,null,null,null,"double vitrage de + de 10 ans (ex : 4/6/4 ou 4/8/4 air)",0.5,null,null,null,null,null,"Jul",5820,5780,17,"0.47","21.2","20.0",3]
["Facteur solaire S  :",{"$f":"IF(Chauffage!H20=0,INDEX(N11:O17,N10,2),0.4)","v":0.4},null,null,null,"-",null,null,null,null,null,null,null,"double vitrage 5 à 10 ans (ex: 4/10/4 ou 4/12/4 air)",0.4,null,null,null,null,null,"Aug",4960,5330,27,"0.48","21.1","19.8",24]
["Surfaces des ouvertures",null,null,null,null,null,null,null,null,null,null,null,null,"double vitrage de moins de 5 ans (ex : 4/16/4 argon)",0.3,null,null,null,null,null,"Sep",3650,4470,42,"0.48","17.1","15.7",122]
["Surface totale Nord :",{"$f":"Calcul!N5","v":0},"m²",null,null,null,null,null,null,null,null,null,null,"double vitrage à contrôle solaire renforcé",0.25,null,null,null,null,null,"Oct",2090,2820,52,"0.58","13.5","12.2",255]
["Surface totale NE NO:",{"$f":"Calcul!M5","v":0},null,null,null,null,null,null,null,null,null,null,null,"triple vitrage",0.25,null,null,null,null,null,"Nov",1140,1700,60,"0.65","6.9","5.9",426]
["Surface totale Est :",{"$f":"Calcul!K5","v":0},"m²",null,null,null,null,null,null,null,null,null,null,"triple vitrage à facteur solaire amélioré",0.3,null,null,null,null,null,"Dec",60,1150,63,"0.71","3.5","2.9",472]
["Surface totale SE SO:",{"$f":"Calcul!J5","v":0},null,null,null,null,null,null,null,null,null,null,null,null,null,null,null,null,null,null,"Year",3180,3570,33,"0.53","12.2","11.0",2705,"(DJU","annuel)"]
["Surface totale Sud :",{"$f":"Calcul!I5","v":0},"m²",null,null,null,null,null,null,null,null,null,null,null,null,null,null,null,null,null,"Wh:","Irradiation","on","horizontal","plane","(Wh/m2)"]
["Surface totale Ouest :",{"$f":"Calcul!L5","v":0},"m²",null,null,null,null,null,null,"nul",1,null,null,null,null,null,null,null,null,null,"Whopt:","Irradiation","on","optimally","inclined","plane","(Wh/m2)"]
["horizontal",{"$f":"Calcul!Q5","v":0},null,null,null,null,null,null,null,"très faible",0.85,null,null,null,null,null,null,null,null,null,"Iopt:","Optimal","inclination","(deg.)"]
["Correction pour l'ombrage (FS)",null,null,null,null,null,null,null,null,"moyen",0.5,null,null,null,null,null,null,null,null,null,"D/G:","Ratio","of","diffuse","to","global","irradiation","(-)"]
["Correction Nord :",{"$f":"VLOOKUP(Calcul!N6,'Apports solaires'!$J$20:$K$24,2,FALSE)","v":{"$error":"#N/A"}},"-",null,null,null,null,null,null,"élevé",0.25,null,null,null,null,null,null,null,null,null,"TD:","Average","daytime","temperature","(°C)"]
["correction NE NO",{"$f":"VLOOKUP(Calcul!M6,'Apports solaires'!$J$20:$K$24,2,FALSE)","v":{"$error":"#N/A"}},null,null,null,null,null,null,null,"total",0.05,null,null,null,null,null,null,null,null,null,"T24h:",24,"hour","average","of","temperature","(°C)"]
["Correction Est :",{"$f":"VLOOKUP(Calcul!K6,'Apports solaires'!$J$20:$K$24,2,FALSE)","v":{"$error":"#N/A"}},"-",null,null,null,null,null,null,null,null,null,null,null,null,null,null,null,null,null,"NDD:","Number","of","heating","degree-days","(-)"]
["Correction SE SO",{"$f":"VLOOKUP(Calcul!J6,'Apports solaires'!$J$20:$K$24,2,FALSE)","v":{"$error":"#N/A"}},null,null,null,null,null,null,null,"OUI"]
["Correction Sud :",{"$f":"VLOOKUP(Calcul!I6,'Apports solaires'!$J$20:$K$24,2,FALSE)","v":{"$error":"#N/A"}},"-",null,null,null,null,null,null,"NON"]
["Correction Ouest :",{"$f":"VLOOKUP(Calcul!L6,'Apports solaires'!$J$20:$K$24,2,FALSE)","v":{"$error":"#N/A"}},"-"]
["Correction hriz:",{"$f":"VLOOKUP(Calcul!Q6,'Apports solaires'!$J$20:$K$24,2,FALSE)","v":{"$error":"#N/A"}},null,null,null,null,{"$f":"Chauffage!B18","v":{"$error":"#VALUE!"}},null,null,"Solaire thermique"]
[null,null,null,null,null,null,null,null,null,"ECS",null,"Est",0.85]
[null,null,null,null,null,null,null,null,null,"Chauffage + ECS",null,"Sud - Est",0.92]
[null,null,null,null,null,null,null,null,null,"sans système solaire",null,"Sud",1]
[null,null,null,null,null,null,null,null,null,null,null,"Sud - Ouest",0.92]
[null,null,null,null,null,null,null,null,null,null,null,"Ouest",0.85]
[null,null,null,null,null,null,null,null,null,null,null,"Nord - Ouest"]
[null,null,null,null,null,null,null,null,null,null,null,"Nord "]
[null,null,null,null,null,null,null,null,null,null,null,"Nord - Est"]
[null,null,null,null,null,null,null,null,null,null,null,"intérieur"]
[]
[]
["Apports solaires janvier (QSj)",null,null,null,null,null,null,null,"Apports solaires Fevrier (QSj)",null,null,null,null,null,null,null,"Apports solaires Mars (QSj)",null,null,null,null,null,null,null,"Apports solaires Avril (QSj)",null,null,null,null,null,null,null,"Apports solaires Octobre (QSj)",null,null,null,null,null,null,null,"Apports solaires Novembre(QSj)",null,null,null,null,null,null,null,"Apports solaires Decembre (QSj)",null,null,null,null,null,null,null,"mai",null,null,null,null,null,null,null,"juin",null,null,null,null,null,null,null,"juillet",null,null,null,null,null,null,null,"aout",null,null,null,null,null,null,null,"septembre"]
[]
["Facteur solaire S  :",null,null,null,null,"-"]
["Surfaces des ouvertures",null,null,"Aire réceptrices équivalentes"]
["Surface totale Nord :",{"$f":"B15","v":0},"m²","Aire Nord :",{"$f":"B45*B62*$B$13","v":0},"m²"]
["Surface totale NE NO:",0,null,"Aire NE NO",0,"m²"]
["Surface totale Est :",0,"m²","Aire Est :",0,"m²"]
["Surface totale SE SO:",0,null,"Aire SE SO",0,"m²"]
["Surface totale Sud :",0,"m²","Aire Sud :",0,"m²"]
["Surface totale Ouest :",0,"m²","Aire Ouest :",0,"m²"]
["horizontal",{"$f":"B21","v":0},null,"Aire hrz",0]
["Irradiation solaire (IS)",null,null,"Apports solaires horaires (QS)",null,null,null,null,"Irradiation solaire (IS)",null,null,"Apports solaires horaires (QS)",null,null,null,null,"Irradiation solaire (IS)",null,null,"Apports solaires horaires (QS)",null,null,null,null,"Irradiation solaire (IS)",null,null,"Apports solaires horaires (QS)",null,null,null,null,"Irradiation solaire (IS)",null,null,"Apports solaires horaires (QS)",null,null,null,null,"Irradiation solaire (IS)",null,null,"Apports solaires horaires (QS)",null,null,null,null,"Irradiation solaire (IS)",null,null,"Apports solaires horaires (QS)",null,null,null,null,"Irradiation solaire (IS)",null,null,"Apports solaires horaires (QS)",null,null,null,null,"Irradiation solaire (IS)",null,null,"Apports solaires horaires (QS)",null,null,null,null,"Irradiation solaire (IS)",null,null,"Apports solaires horaires (QS)",null,null,null,null,"Irradiation solaire (IS)",null,null,"Apports solaires horaires (QS)",null,null,null,null,"Irradiation solaire (IS)",null,null,"Apports solaires horaires (QS)"]
["Nord :",{"$f":"B3","v":{"$error":"#VALUE!"}},"kwh","QS Nord :",{"$f":"B53*E45","v":{"$error":"#VALUE!"}},"kwh/j",{"$f":"E53/1000","v":{"$error":"#VALUE!"}},null,"Nord :",{"$f":"C3","v":{"$error":"#VALUE!"}},"W","QS Nord :",{"$f":"J53*$E$45","v":{"$error":"#VALUE!"}},"W",{"$f":"M53/1000","v":{"$error":"#VALUE!"}},"kwh","Nord :",{"$f":"D3","v":{"$error":"#VALUE!"}},"W","QS Nord :",{"$f":"R53*$E$45","v":{"$error":"#VALUE!"}},"W",{"$f":"U53/1000","v":{"$error":"#VALUE!"}},"kwh","Nord :",{"$f":"E3","v":{"$error":"#VALUE!"}},"W","QS Nord :",{"$f":"Z53*$E$45","v":{"$error":"#VALUE!"}},"W",{"$f":"AC53/1000","v":{"$error":"#VALUE!"}},"kwh","Nord :",{"$f":"K3","v":{"$error":"#VALUE!"}},"W","QS Nord :",{"$f":"AH53*$E$45","v":{"$error":"#VALUE!"}},"W",{"$f":"AK53/1000","v":{"$error":"#VALUE!"}},"kwh","Nord :",{"$f":"L3","v":{"$error":"#VALUE!"}},"W","QS Nord :",{"$f":"AP53*$E$45","v":{"$error":"#VALUE!"}},"W",{"$f":"AS53/1000","v":{"$error":"#VALUE!"}},"kwh","Nord :",{"$f":"M3","v":{"$error":"#VALUE!"}},"W","QS Nord :",{"$f":"AX53*$E$45","v":{"$error":"#VALUE!"}},"W",{"$f":"BA53/1000","v":{"$error":"#VALUE!"}},"kwh","Nord :",{"$f":"F3","v":{"$error":"#VALUE!"}},"W","QS Nord :",{"$f":"BF53*$E$45","v":{"$error":"#VALUE!"}},"W",{"$f":"BI53/1000","v":{"$error":"#VALUE!"}},"kwh","Nord :",{"$f":"$G3","v":{"$error":"#VALUE!"}},"W","QS Nord :",{"$f":"BN53*$E$45","v":{"$error":"#VALUE!"}},"W",{"$f":"BQ53/1000","v":{"$error":"#VALUE!"}},null,"Nord :",{"$f":"$H3","v":{"$error":"#VALUE!"}},"W","QS Nord :",{"$f":"BV53*$E$45","v":{"$error":"#VALUE!"}},"W",{"$f":"BY53/1000","v":{"$error":"#VALUE!"}},null,"Nord :",{"$f":"$I3","v":{"$error":"#VALUE!"}},"W","QS Nord :",{"$f":"CD53*$E$45","v":{"$error":"#VALUE!"}},"W",{"$f":"CG53/1000","v":{"$error":"#VALUE!"}},null,"Nord :",{"$f":"$J3","v":{"$error":"#VALUE!"}},"W","QS Nord :",{"$f":"CL53*$E$45","v":{"$error":"#VALUE!"}},"W",{"$f":"CO53/1000","v":{"$error":"#VALUE!"}}]
["Ne no",{"$error":"#VALUE!"},"kwh","Qs NE NO",{"$error":"#VALUE!"},"kwh/j",{"$f":"E54/1000","v":{"$error":"#VALUE!"}},null,"Ne no",{"$error":"#VALUE!"},"w",null,{"$f":"J54*$E$46","v":{"$error":"#VALUE!"}},"W",{"$f":"M54/1000","v":{"$error":"#VALUE!"}},"kwh","Ne no",{"$error":"#VALUE!"},"w",null,{"$f":"R54*$E$46","v":{"$error":"#VALUE!"}},"W",{"$f":"U54/1000","v":{"$error":"#VALUE!"}},"kwh","Ne no",{"$error":"#VALUE!"},"w",null,{"$f":"Z54*$E$46","v":{"$error":"#VALUE!"}},"W",{"$f":"AC54/1000","v":{"$error":"#VALUE!"}},"kwh","Ne no",{"$error":"#VALUE!"},"w",null,{"$f":"AH54*$E$46","v":{"$error":"#VALUE!"}},"W",{"$f":"AK54/1000","v":{"$error":"#VALUE!"}},"kwh","Ne no",{"$error":"#VALUE!"},"w",null,{"$f":"AP54*$E$46","v":{"$error":"#VALUE!"}},"W",{"$f":"AS54/1000","v":{"$error":"#VALUE!"}},"kwh","Ne no",{"$error":"#VALUE!"},"w",null,{"$f":"AX54*$E$46","v":{"$error":"#VALUE!"}},"W",{"$f":"BA54/1000","v":{"$error":"#VALUE!"}},"kwh","Ne no",{"$error":"#VALUE!"},"w",null,{"$f":"BF54*$E$46","v":{"$error":"#VALUE!"}},"W",{"$f":"BI54/1000","v":{"$error":"#VALUE!"}},"kwh","Ne no",{"$error":"#VALUE!"},"w",null,{"$f":"BN54*$E$46","v":{"$error":"#VALUE!"}},"W",{"$f":"BQ54/1000","v":{"$error":"#VALUE!"}},null,"Ne no",{"$error":"#VALUE!"},"w",null,{"$f":"BV54*$E$46","v":{"$error":"#VALUE!"}},"W",{"$f":"BY54/1000","v":{"$error":"#VALUE!"}},null,"Ne no",{"$error":"#VALUE!"},"w",null,{"$f":"CD54*$E$46","v":{"$error":"#VALUE!"}},"W",{"$f":"CG54/1000","v":{"$error":"#VALUE!"}},null,"Ne no",{"$error":"#VALUE!"},"w",null,{"$f":"CL54*$E$46","v":{"$error":"#VALUE!"}},"W",{"$f":"CO54/1000","v":{"$error":"#VALUE!"}}]
["Est :",{"$error":"#VALUE!"},"kwh","QS Est :",{"$error":"#VALUE!"},"kwh/j",{"$error":"#VALUE!"},null,"Est :",{"$error":"#VALUE!"},"W","QS Est :",{"$f":"J55*$E$47","v":{"$error":"#VALUE!"}},"W",{"$error":"#VALUE!"},"kwh","Est :",{"$error":"#VALUE!"},"W","QS Est :",{"$f":"R55*$E$47","v":{"$error":"#VALUE!"}},"W",{"$error":"#VALUE!"},"kwh","Est :",{"$error":"#VALUE!"},"W","QS Est :",{"$f":"Z55*$E$47","v":{"$error":"#VALUE!"}},"W",{"$error":"#VALUE!"},"kwh","Est :",{"$error":"#VALUE!"},"W","QS Est :",{"$f":"AH55*$E$47","v":{"$error":"#VALUE!"}},"W",{"$error":"#VALUE!"},"kwh","Est :",{"$error":"#VALUE!"},"W","QS Est :",{"$f":"AP55*$E$47","v":{"$error":"#VALUE!"}},"W",{"$error":"#VALUE!"},"kwh","Est :",{"$error":"#VALUE!"},"W","QS Est :",{"$f":"AX55*$E$47","v":{"$error":"#VALUE!"}},"W",{"$error":"#VALUE!"},"kwh","Est :",{"$error":"#VALUE!"},"W","QS Est :",{"$f":"BF55*$E$47","v":{"$error":"#VALUE!"}},"W",{"$error":"#VALUE!"},"kwh","Est :",{"$error":"#VALUE!"},"W","QS Est :",{"$f":"BN55*$E$47","v":{"$error":"#VALUE!"}},"W",{"$error":"#VALUE!"},null,"Est :",{"$error":"#VALUE!"},"W","QS Est :",{"$f":"BV55*$E$47","v":{"$error":"#VALUE!"}},"W",{"$error":"#VALUE!"},null,"Est :",{"$error":"#VALUE!"},"W","QS Est :",{"$f":"CD55*$E$47","v":{"$error":"#VALUE!"}},"W",{"$error":"#VALUE!"},null,"Est :",{"$error":"#VALUE!"},"W","QS Est :",{"$f":"CL55*$E$47","v":{"$error":"#VALUE!"}},"W",{"$error":"#VALUE!"}]
["SE SO",{"$error":"#VALUE!"},"kwh","Qs SE SO",{"$error":"#VALUE!"},"kwh/j",{"$error":"#VALUE!"},null,"SE SO",{"$error":"#VALUE!"},"w",null,{"$f":"J56*$E$48","v":{"$error":"#VALUE!"}},"W",{"$error":"#VALUE!"},"kwh","SE SO",{"$error":"#VALUE!"},"w",null,{"$f":"R56*$E$48","v":{"$error":"#VALUE!"}},"W",{"$error":"#VALUE!"},"kwh","SE SO",{"$error":"#VALUE!"},"w",null,{"$f":"Z56*$E$48","v":{"$error":"#VALUE!"}},"W",{"$error":"#VALUE!"},"kwh","SE SO",{"$error":"#VALUE!"},"w",null,{"$f":"AH56*$E$48","v":{"$error":"#VALUE!"}},"W",{"$error":"#VALUE!"},"kwh","SE SO",{"$error":"#VALUE!"},"w",null,{"$f":"AP56*$E$48","v":{"$error":"#VALUE!"}},"W",{"$error":"#VALUE!"},"kwh","SE SO",{"$error":"#VALUE!"},"w",null,{"$f":"AX56*$E$48","v":{"$error":"#VALUE!"}},"W",{"$error":"#VALUE!"},"kwh","SE SO",{"$error":"#VALUE!"},"w",null,{"$f":"BF56*$E$48","v":{"$error":"#VALUE!"}},"W",{"$error":"#VALUE!"},"kwh","SE SO",{"$error":"#VALUE!"},"w",null,{"$f":"BN56*$E$48","v":{"$error":"#VALUE!"}},"W",{"$error":"#VALUE!"},null,"SE SO",{"$error":"#VALUE!"},"w",null,{"$f":"BV56*$E$48","v":{"$error":"#VALUE!"}},"W",{"$error":"#VALUE!"},null,"SE SO",{"$error":"#VALUE!"},"w",null,{"$f":"CD56*$E$48","v":{"$error":"#VALUE!"}},"W",{"$error":"#VALUE!"},null,"SE SO",{"$error":"#VALUE!"},"w",null,{"$f":"CL56*$E$48","v":{"$error":"#VALUE!"}},"W",{"$error":"#VALUE!"}]
["Sud :",{"$error":"#VALUE!"},"kwh","QS Sud :",{"$f":"B57*E49","v":{"$error":"#VALUE!"}},"kwh/j",{"$error":"#VALUE!"},null,"Sud :",{"$error":"#VALUE!"},"W","QS Sud :",{"$f":"J57*$E$49","v":{"$error":"#VALUE!"}},"W",{"$error":"#VALUE!"},"kwh","Sud :",{"$error":"#VALUE!"},"W","QS Sud :",{"$f":"R57*$E$49","v":{"$error":"#VALUE!"}},"W",{"$error":"#VALUE!"},"kwh","Sud :",{"$error":"#VALUE!"},"W","QS Sud :",{"$f":"Z57*$E$49","v":{"$error":"#VALUE!"}},"W",{"$error":"#VALUE!"},"kwh","Sud :",{"$error":"#VALUE!"},"W","QS Sud :",{"$f":"AH57*$E$49","v":{"$error":"#VALUE!"}},"W",{"$error":"#VALUE!"},"kwh","Sud :",{"$error":"#VALUE!"},"W","QS Sud :",{"$f":"AP57*$E$49","v":{"$error":"#VALUE!"}},"W",{"$error":"#VALUE!"},"kwh","Sud :",{"$error":"#VALUE!"},"W","QS Sud :",{"$f":"AX57*$E$49","v":{"$error":"#VALUE!"}},"W",{"$error":"#VALUE!"},"kwh","Sud :",{"$error":"#VALUE!"},"W","QS Sud :",{"$f":"BF57*$E$49","v":{"$error":"#VALUE!"}},"W",{"$error":"#VALUE!"},"kwh","Sud :",{"$error":"#VALUE!"},"W","QS Sud :",{"$f":"BN57*$E$49","v":{"$error":"#VALUE!"}},"W",{"$error":"#VALUE!"},null,"Sud :",{"$error":"#VALUE!"},"W","QS Sud :",{"$f":"BV57*$E$49","v":{"$error":"#VALUE!"}},"W",{"$error":"#VALUE!"},null,"Sud :",{"$error":"#VALUE!"},"W","QS Sud :",{"$f":"CD57*$E$49","v":{"$error":"#VALUE!"}},"W",{"$error":"#VALUE!"},null,"Sud :",{"$error":"#VALUE!"},"W","QS Sud :",{"$f":"CL57*$E$49","v":{"$error":"#VALUE!"}},"W",{"$error":"#VALUE!"}]
["Ouest :",{"$error":"#VALUE!"},"kwh","QS Ouest :",{"$error":"#VALUE!"},"kwh/j",{"$error":"#VALUE!"},null,"Ouest :",{"$error":"#VALUE!"},"W","QS Ouest :",{"$f":"J58*$E$50","v":{"$error":"#VALUE!"}},"W",{"$error":"#VALUE!"},"kwh","Ouest :",{"$error":"#VALUE!"},"W","QS Ouest :",{"$f":"R58*$E$50","v":{"$error":"#VALUE!"}},"W",{"$error":"#VALUE!"},"kwh","Ouest :",{"$error":"#VALUE!"},"W","QS Ouest :",{"$f":"Z58*$E$50","v":{"$error":"#VALUE!"}},"W",{"$error":"#VALUE!"},"kwh","Ouest :",{"$error":"#VALUE!"},"W","QS Ouest :",{"$f":"AH58*$E$50","v":{"$error":"#VALUE!"}},"W",{"$error":"#VALUE!"},"kwh","Ouest :",{"$error":"#VALUE!"},"W","QS Ouest :",{"$f":"AP58*$E$50","v":{"$error":"#VALUE!"}},"W",{"$error":"#VALUE!"},"kwh","Ouest :",{"$error":"#VALUE!"},"W","QS Ouest :",{"$f":"AX58*$E$50","v":{"$error":"#VALUE!"}},"W",{"$error":"#VALUE!"},"kwh","Ouest :",{"$error":"#VALUE!"},"W","QS Ouest :",{"$f":"BF58*$E$50","v":{"$error":"#VALUE!"}},"W",{"$error":"#VALUE!"},"kwh","Ouest :",{"$error":"#VALUE!"},"W","QS Ouest :",{"$f":"BN58*$E$50","v":{"$error":"#VALUE!"}},"W",{"$error":"#VALUE!"},null,"Ouest :",{"$error":"#VALUE!"},"W","QS Ouest :",{"$f":"BV58*$E$50","v":{"$error":"#VALUE!"}},"W",{"$error":"#VALUE!"},null,"Ouest :",{"$error":"#VALUE!"},"W","QS Ouest :",{"$f":"CD58*$E$50","v":{"$error":"#VALUE!"}},"W",{"$error":"#VALUE!"},null,"Ouest :",{"$error":"#VALUE!"},"W","QS Ouest :",{"$f":"CL58*$E$50","v":{"$error":"#VALUE!"}},"W",{"$error":"#VALUE!"}]
["horizontal",{"$f":"B9","v":{"$error":"#VALUE!"}},null,"QS hrz",{"$error":"#VALUE!"},"kwh/j",{"$error":"#VALUE!"},null,{"$f":"A59","v":"horizontal"},{"$error":"#VALUE!"},null,"QS hrz",{"$f":"J59*$E$51","v":{"$error":"#VALUE!"}},"W",{"$error":"#VALUE!"},"kwh",{"$f":"I59","v":"horizontal"},{"$error":"#VALUE!"},null,"QS hrz",{"$f":"R59*$E$51","v":{"$error":"#VALUE!"}},null,{"$error":"#VALUE!"},"kwh",{"$f":"Q59","v":"horizontal"},{"$error":"#VALUE!"},null,"QS hrz",{"$f":"Z59*$E$51","v":{"$error":"#VALUE!"}},null,{"$error":"#VALUE!"},"kwh",{"$f":"Y59","v":"horizontal"},{"$error":"#VALUE!"},null,"QS hrz",{"$f":"AH59*$E$51","v":{"$error":"#VALUE!"}},null,{"$error":"#VALUE!"},"kwh",{"$f":"AG59","v":"horizontal"},{"$error":"#VALUE!"},null,"QS hrz",{"$f":"AP59*$E$51","v":{"$error":"#VALUE!"}},null,{"$error":"#VALUE!"},"kwh",{"$f":"AO59","v":"horizontal"},{"$error":"#VALUE!"},null,"QS hrz",{"$f":"AX59*$E$51","v":{"$error":"#VALUE!"}},null,{"$error":"#VALUE!"},"kwh",{"$f":"AW59","v":"horizontal"},{"$error":"#VALUE!"},null,"QS hrz",{"$f":"BF59*$E$51","v":{"$error":"#VALUE!"}},null,{"$error":"#VALUE!"},"kwh",{"$f":"BE59","v":"horizontal"},{"$error":"#VALUE!"},null,"QS hrz",{"$f":"BN59*$E$51","v":{"$error":"#VALUE!"}},null,{"$error":"#VALUE!"},null,{"$f":"BM59","v":"horizontal"},{"$error":"#VALUE!"},null,"QS hrz",{"$f":"BV59*$E$51","v":{"$error":"#VALUE!"}},null,{"$error":"#VALUE!"},null,{"$f":"BU59","v":"horizontal"},{"$error":"#VALUE!"},null,"QS hrz",{"$f":"CD59*$E$51","v":{"$error":"#VALUE!"}},null,{"$error":"#VALUE!"},null,{"$f":"CC59","v":"horizontal"},{"$error":"#VALUE!"},null,"QS hrz",{"$f":"CL59*$E$51","v":{"$error":"#VALUE!"}},null,{"$error":"#VALUE!"}]
[null,null,null,"Total :",{"$f":"SUM(E53:E59)","v":{"$error":"#VALUE!"}},"kwh/j",{"$f":"E60/1000","v":{"$error":"#VALUE!"}},null,null,null,null,"Total :",{"$f":"SUM(M53:M59)","v":{"$error":"#VALUE!"}},"W",{"$f":"M60/1000","v":{"$error":"#VALUE!"}},null,null,null,null,"Total :",{"$f":"SUM(U53:U59)","v":{"$error":"#VALUE!"}},"W",{"$f":"U60/1000","v":{"$error":"#VALUE!"}},null,null,null,null,"Total :",{"$f":"SUM(AC53:AC59)","v":{"$error":"#VALUE!"}},"W",{"$f":"AC60/1000","v":{"$error":"#VALUE!"}},null,null,null,null,"Total :",{"$f":"SUM(AK53:AK59)","v":{"$error":"#VALUE!"}},"W",{"$f":"AK60/1000","v":{"$error":"#VALUE!"}},null,null,null,null,"Total :",{"$f":"SUM(AS53:AS59)","v":{"$error":"#VALUE!"}},"W",{"$f":"AS60/1000","v":{"$error":"#VALUE!"}},null,null,null,null,"Total :",{"$f":"SUM(BA53:BA59)","v":{"$error":"#VALUE!"}},"W",{"$f":"BA60/1000","v":{"$error":"#VALUE!"}},null,null,null,null,"Total :",{"$f":"SUM(BI53:BI59)","v":{"$error":"#VALUE!"}},"W",{"$f":"BI60/1000","v":{"$error":"#VALUE!"}},null,null,null,null,"Total :",{"$f":"SUM(BQ53:BQ59)","v":{"$error":"#VALUE!"}},"W",{"$f":"BQ60/1000","v":{"$error":"#VALUE!"}},null,null,null,null,"Total :",{"$f":"SUM(BY53:BY59)","v":{"$error":"#VALUE!"}},"W",{"$f":"BY60/1000","v":{"$error":"#VALUE!"}},null,null,null,null,"Total :",{"$f":"SUM(CG53:CG59)","v":{"$error":"#VALUE!"}},"W",{"$f":"CG60/1000","v":{"$error":"#VALUE!"}},null,null,null,null,"Total :",{"$f":"SUM(CO53:CO59)","v":{"$error":"#VALUE!"}},"W",{"$f":"CO60/1000","v":{"$error":"#VALUE!"}}]
["Correction pour l'ombrage (FS)"]
["Correction Nord :",{"$f":"IFERROR(B23,0)","v":0},"-"]
["correction NE NO",{"$f":"IFERROR(B24,0)","v":0}]
["Correction Est :",0,"-"]
["Correction SE SO",0]
["Correction Sud :",0,"-"]
["Correction Ouest :",0,"-"]
["Correction hriz:",0,null,null,{"$f":"E60*31","v":{"$error":"#VALUE!"}},null,null,null,null,null,null,null,{"$f":"M60*28","v":{"$error":"#VALUE!"}},null,null,null,null,null,null,null,{"$f":"U60*31","v":{"$error":"#VALUE!"}},null,null,null,null,null,null,null,{"$f":"AC60*30","v":{"$error":"#VALUE!"}},null,null,null,null,null,null,null,{"$f":"AK60*31","v":{"$error":"#VALUE!"}},null,null,null,null,null,null,null,{"$f":"AS60*30","v":{"$error":"#VALUE!"}},null,null,null,null,null,null,null,{"$f":"BA60*31","v":{"$error":"#VALUE!"}},null,null,null,null,null,null,null,{"$f":"BI60*31","v":{"$error":"#VALUE!"}},null,null,null,null,null,null,null,{"$f":"BQ60*30","v":{"$error":"#VALUE!"}},null,null,null,null,null,null,null,{"$f":"BY60*31","v":{"$error":"#VALUE!"}},null,null,null,null,null,null,null,{"$f":"CG60*31","v":{"$error":"#VALUE!"}},null,null,null,null,null,null,null,{"$f":"CO60*30","v":{"$error":"#VALUE!"}}]

{"sheet":"BDD typo","index":16,"n_rows":69,"n_cols":45,"rows_kept":69,"cut":false,"hidden":true,"merged":[[2,16,2,17],[2,14,2,15],[2,12,2,13],[2,10,2,11],[2,8,2,9]]}
[{"$f":"VLOOKUP(Saisies!E6,'BDD typo'!B5:C16,2,FALSE)","v":{"$error":"#N/A"}},null,null,"mdp",0,null,1]
[null,"Entrées typo",2,3,4,5,6,7,8,9,10,11,12,13,14,15,16,17,18,19,20,21,22,23,24,25,26,27,28,29,30,31,32,33,34,35,36,37,38,39,40,41,42]
[null,null,null,null,"énergie chauffage","Epaisseur des murs","U murs niveau 1","U murs niveau 2","U  toit niveau 1",null,"U  toit niveau 2",null,"U plancher niveau 1 ",null,"U plancher niveau 2",null,"UW vitrages",null,"surface nord","surface sud","surface est","surface ouest","angle de deux murs extérieurs sortant","angle de deux murs extérieurs rentrant","angle mur ext / refend","angle mur ext / cloison","Mur ext / plancher ext (L8)","Mur ext / plancher interm PSI ou PSI1 (L9)","Mur ext / plancher interm PSI2 (L9)","Mur ext / plafond lourds (L10)","Mur ext / Terasse (L10)","Mur ext / plafond (L10)","Refend / plancher ext/lnc PSI ou PSI1 (L8)","Refend / plancher ext/lnc PS2 ou PSI3 (L8)","Refend / plafond ext/lnc PSI ou PSI1 (L10)","Refend / plancher ext/lnc PS2 ou PSI3 (L10)","Refend / plafond léger","Divers (L8)","Divers (L9)","Divers (L10)","Autre Liaison Divers","Terre plein (L8)","Pont Thermique ponctuel 3D","u portes","select"]
[null,null,null,null,null,null,null,null,"Combles perdus","Rampant","Combles perdus","Rampant","Terre plein","Vide sanitaire","Terre plein","Vide sanitaire"]
[null,"Maison individuelle avant 48",1,"Individuelle","fioul",0.6,2,1,3,0.56000000000000005,0.25,0.25,0.6,0.9,0.22,0.3,3.5,2.5,0.25,0.25,0.25,0.25,0.2,0.5,0.35,null,0.8,0.6,null,null,null,0.2,null,null,null,null,null,null,null,null,null,0.70000000000000007,null,3,1]
[null,"Maison individuelle entre 49 et 74",2,"Individuelle","fioul",0.2,2,1,1.8,0.5,0.23,0.23,0.6,0.9,0.22,0.3,3.5,2.5,0.25,0.25,0.25,0.25,0.2,0.5,0.35,null,0.8,0.6,null,null,null,0.2,null,null,null,null,null,null,null,null,null,0.70000000000000007,null,3,2]
[null,"maison individuelle entre 75 et 88",3,"Individuelle","fioul",0.3,1,0.8,1.2,0.42,0.2,0.2,0.45,0.6,0.22,0.25,2.5,2,0.2,0.3,0.25,0.25,0.3,0.45000000000000007,0.24999999999999997,null,0.70000000000000007,0.5,null,null,null,0.5,null,null,null,null,null,null,null,null,null,0.60000000000000009,null,3,3]
[null,"maison individuelle entre 89 et 2005",4,"Individuelle","gaz",0.3,0.6,0.5,0.9,0.35,0.18,0.18,0.3,0.45,0.2,0.2,2,1.8,0.2,0.3,0.25,0.25,0.3,0.35,0.15,null,0.60000000000000009,0.4,null,null,null,0.60000000000000009,null,null,null,null,null,null,null,null,null,0.50000000000000011,null,2.5,4]
[null,"collectif avant 48",1,"collectif","fioul",0.6,2,1,3,0.56000000000000005,0.25,0.25,0.6,0.9,0.22,0.3,3.5,2.5,0.25,0.25,0.25,0.25,0.2,0.5,0.35,null,0.8,0.6,null,null,null,0.2,null,null,null,null,null,null,null,null,null,0.70000000000000007,null,3,5]
[null,"collectif entre 49 et 74",2,"collectif","fioul",0.2,2,1,1.8,0.5,0.23,0.23,0.6,0.9,0.22,0.3,3.5,2.5,0.25,0.25,0.25,0.25,0.2,0.5,0.35,null,0.8,0.6,null,null,null,0.2,null,null,null,null,null,null,null,null,null,0.70000000000000007,null,3,6]
[null,"collectif entre 75 et 88",3,"collectif","fioul",0.3,1,0.8,1.2,0.42,0.2,0.2,0.45,0.6,0.22,0.25,2.5,2,0.2,0.3,0.25,0.25,0.3,0.45000000000000007,0.24999999999999997,null,0.70000000000000007,0.5,null,null,null,0.5,null,null,null,null,null,null,null,null,null,0.60000000000000009,null,3,7]
[null,"collectif entre 89 et 2005",4,"collectif","gaz",0.3,0.6,0.5,0.9,0.35,0.18,0.18,0.3,0.45,0.2,0.2,2,1.8,0.2,0.3,0.25,0.25,0.3,0.35,0.15,null,0.60000000000000009,0.4,null,null,null,0.60000000000000009,null,null,null,null,null,null,null,null,null,0.50000000000000011,null,2.5,8]
[null,"tertiaire bureaux",9,null,null,null,null,null,null,null,null,null,null,null,null,null,null,null,null,null,null,null,null,null,null,null,null,null,null,null,null,null,null,null,null,null,null,null,null,null,null,null,null,null,9]
[]
[]
[]
[]
[]
[]
[]
[]
[]
[]
[]
[]
[]
[]
[]
[]
[]
[]
[]
[]
[]
[]
[]
[]
[]
[]
[]
[]
[]
[]
[]
[]
[]
[]
[]
[]
[]
[]
[]
[]
[]
[]
[]
[]
[]
[]
[]
[]
[]
[]
[]
[null,"département",null,null,null,null,"type sol"]
[null,25,null,null,null,null,"argile ou limon"]
[null,39,null,null,null,null,"sable ou gravier"]
[null,70,null,null,null,null,"sol par roche homogène"]
[null,90,null,null,null,null,"roche homogène"]

{"sheet":"matériaux","index":17,"n_rows":90,"n_cols":11,"rows_kept":90,"cut":false,"hidden":true,"merged":[]}
["Matériau","Lambda",null,"Commentaire",null,null,"Isolant",null,null,0.04,{"$f":"SUM(J1:J11)","v":0.4107738095238096}]
[null,"W/m/°C",null,null,null,null,"Semi-isolant",null,null,0.20952380952380956]
["_____Isolant",null,null,null,null,null,"Porteur",null,null,0]
["Botte de paille",4.8000000000000001E-2,null,"Sur champ",null,null,"Parement",null,null,3.125E-2]
["copeaux en vrac",0.05,null,"Bois imputrescible. ou passage à l'eau de chaux ou imprégnation au bore",null,null,"Lame d'air",null,null,0]
["Roseaux en panneaux",5.6000000000000001E-2,null,null,null,null,"bibliothèque perso",null,null,0]
["Cellulose 35kg/m3 en vrac",3.9E-2,null,"Pose manuelle. comble perdu",null,null,null,null,null,0]
["Cellulose 35kg/m3 soufflée",3.9E-2,null,"Pose machine par artisan. comble perdu ou sur-toiture",null,null,null,null,null,0]
["Cellulose 55kg/m3 insufflée",3.9E-2,null,"Pose machine par artisan. mur ou sous-toiture",null,null,null,null,null,0]
["Cellulose en panneau",0.04,null,"Excellent en phonique (bruits aériens)",null,null,null,null,null,0]
["Liège en granulés",4.1666666666666699E-2,null,"Imputrescible",null,null,null,null,null,0.13]
["Liège expansé en panneau",3.7999999999999999E-2,null,"Imputrescible. bonne accroche pour enduit"]
["Vermiculite en vrac",6.8000000000000005E-2,null,"Non combustible"]
["Perlite en vrac",4.7E-2,null,"Non combustible"]
["Fibre de bois 0.038",3.7999999999999999E-2,null,"holzflex standard"]
["Fibre de bois 0.042",4.2000000000000003E-2,null,"holzflex protect"]
["Fibre de bois 0.047",4.7E-2]
["Fibre de bois 0.05",0.05]
["Laine de chanvre en panneau",4.1000000000000002E-2,null,"Classement feu M4. mur et rampants"]
["Laine de chanvre en rouleau",0.04,null,"Classement feu M4. rampants et sol"]
["chènevotte+bore",5.5E-2,null,"méthode d'imprégnation?"]
["laine minérale demi rigide 0.035",3.5000000000000003E-2,null,"Ursa prk31"]
["laine minérale rigide 0.032",3.2000000000000001E-2]
["laine minérale souple 0.04",0.04]
["laine minérale dégradée (0.05)",0.05]
["TMS (isolation sous chapes)",2.1000000000000001E-2]
["Polyuréthane",2.4E-2,null,"Supporte mal la chaleur. quasi-étanche"]
["Polystyrène graphité",3.4000000000000002E-2,null,"Polystyrène « gris » (expansé + graphite)"]
["polystyrène extrudé",2.7E-2]
["polystyrène expansé",3.5000000000000003E-2]
["STYRODUR 10cm",4.1000000000000002E-2]
["Verre cellulaire",4.2000000000000003E-2,null,"Non combustible. étanche"]
["lin",0.04]
["Sylvactis 140",3.5999999999999997E-2]
["SYLVACTIS 120",3.5999999999999997E-2]
["_____Semi-isolant"]
["Terre-paille",0.09,null,"Remplissage"]
["chaux-chanvre",0.09,null,"Remplissage"]
["chaux-vermiculite",0.1,null,"béton isolant faiblement dosé"]
["Chaux-chanvre-ponce",0.11,null,"Canosmose à bancher"]
["béton cellulaire",0.12,null,"Bloc de construction"]
["beton cellulaire ytong",0.09]
["terre-chanvre",0.12,null,"béton isolant"]
["terre-copeau",0.17,null,"Remplissage"]
["terre-pouzzolane",0.2,null,"béton isolant"]
["_____Porteur"]
["Pierre dure",2.91,null,"Granit. calcaire dur"]
["Pierre poreuse",1.6,null,"Calcaire tendre. grès"]
["pierre tendre (calcauire)",1.2]
["Parpaing béton creux (agglo)",1.05,null,"Macro-proreux"]
["Brique pleine",0.115]
["brique creuse a joint mince ",0.26700000000000002]
["brique a alveoles",0.14899999999999999]
["Brique alvéolée 36.5cm",0.127,null,"Biomur roulé"]
["béton de ciment",1.75,null,"Quasi-étanche"]
["béton armé",2.5]
["béton cellulaire",0.115,null,"Pose joints minces"]
["béton de chaux caverneux",0.7,null,"Tiré du mortier grossier de chaux hydraulique"]
["Béton de chaux chanvre",0.13]
["beton celluliare 0.10",0.1]
["bois massif léger",0.13,null,"20% d'humidité"]
["OSB 9mm",0.12]
["OSB 13mm",0.13]
["agepan",0.09]
["Pavaplan 3F",0.1]
["Pisé",0.85]
["terre végétale",0.8]
["_____Parement"]
["enduit terre",0.91,null,"Mu extrapolé du pisé"]
["enduit chaux",0.7,null,"Tiré du mortier fin de chaux"]
["Crépi ciment",1.5]
["Enduit ciment",0.8]
["Enduit plâtre",0.56999999999999995]
["Brique plâtrière",0.26]
["BA13",0.32]
["Fermacell",0.36]
["planche non-jointive",0.12,null,"Extrapolé. en particulier pour mu"]
["OSB classe 3",0.13]
["_____Lame d'air"]
["Air vertical",0.15625]
["Air horizontal descendant",0.13888888888888901]
["Air horizontal ascendant",0.17857142857142899]
["_____Résistance superficielle"]
["Côté intérieur. plafond",0.1,null,"Utilise Ti. émissivité 0.85"]
["Côté intérieur. plancher",0.17,null,"Utilise Ti. émissivité 0.85"]
["Côté intérieur. mur",0.13,null,"Utilise Ti. émissivité 0.85"]
["Côté extérieur, plafond",0.04,null,"Utilise Te. émissivité 0.85. vent 15km/h"]
["Coté extérieur, plancher",0.04,null,"Utilise Te. émissivité 0.85"]
["coté extérieur mur bardé",0.13,null,"Calcul identique au côté intérieur. mais avec moyenne(Te) à la place de Ti"]
["coté extérieur mur non bardé",0.04]

{"sheet":"Ventilation","index":18,"n_rows":54,"n_cols":15,"rows_kept":54,"cut":false,"hidden":true,"merged":[[48,2,48,8]]}
[]
[]
[]
[]
[]
[null,"Type de logement","Configuration","Débit hygro","pièce supp hygro","calcul hygro","Calcul Débit mini auto","Calcul Débit maxi auto","pièce supp auto","calcul auto mini","calcul auto maxi","calcul naturel"]
[]
[null,null,null,"m3/h","m3/h",null,"m3/h","m3/h","m3/h","m3/h","m3/h"]
[null,"F1","F1 - 1 SDB avec WC",25.3,10.8,{"$f":"D9+Calcul!$C$10*I9","v":25.3},{"$f":"20+15","v":35},{"$f":"75+15","v":90},15,{"$f":"G9+Calcul!$C$10*I9","v":35},{"$f":"H9+Calcul!$C$10*I9","v":90},{"$f":"Calcul!$C$5*0.4","v":0}]
[null,"F1","F1 - 1 SDB + 1 WC indépendant",27.1,6.6,{"$f":"D10+Calcul!$C$10*I10","v":27.1},{"$f":"20+15+15","v":50},{"$f":"75+15+15","v":105},15,{"$f":"G10+Calcul!$C$10*I10","v":50},{"$f":"H10+Calcul!$C$10*I10","v":105},{"$f":"Calcul!$C$5*0.4","v":0}]
[null,"F2","F2 - 1 SDB avec WC",40.4,20.2,{"$f":"D11+Calcul!$C$10*I11","v":40.4},{"$f":"30+15","v":45},{"$f":"90+15","v":105},15,{"$f":"G11+Calcul!$C$10*I11","v":45},{"$f":"H11+Calcul!$C$10*I11","v":105},{"$f":"Calcul!$C$5*0.4","v":0}]
[null,"F2","F2 - 1 SDB + 1 WC indépendant",39.6,11.6,{"$f":"D12+Calcul!$C$10*I12","v":39.6},{"$f":"30+15+15","v":60},{"$f":"90+15+15","v":120},15,{"$f":"G12+Calcul!$C$10*I12","v":60},{"$f":"H12+Calcul!$C$10*I12","v":120},{"$f":"Calcul!$C$5*0.4","v":0}]
[null,"F3","F3 - 1 SDB avec WC",57.8,11.8,{"$f":"D13+Calcul!$C$10*I13","v":57.8},{"$f":"45+30","v":75},{"$f":"105+30","v":135},15,{"$f":"G13+Calcul!$C$10*I13","v":75},{"$f":"H13+Calcul!$C$10*I13","v":135},{"$f":"Calcul!$C$5*0.4","v":0}]
[null,"F3","F3 - 1 SDB + 1 WC indépendant",46.3,11.8,{"$f":"D14+Calcul!$C$10*I14","v":46.3},{"$f":"45+30+15","v":90},{"$f":"105+30+15","v":150},15,{"$f":"G14+Calcul!$C$10*I14","v":90},{"$f":"H14+Calcul!$C$10*I14","v":150},{"$f":"Calcul!$C$5*0.4","v":0}]
[null,"F4","F4 - 1 SDB avec WC",60.1,11.8,{"$f":"D15+Calcul!$C$10*I15","v":60.1},{"$f":"45+30","v":75},{"$f":"120+30","v":150},15,{"$f":"G15+Calcul!$C$10*I15","v":75},{"$f":"H15+Calcul!$C$10*I15","v":150},{"$f":"Calcul!$C$5*0.4","v":0}]
[null,"F4","F4 - 1 SDB + 1 WC indépendant",52.7,11.8,{"$f":"D16+Calcul!$C$10*I16","v":52.7},{"$f":"45+30+30","v":105},{"$f":"120+30+30","v":180},15,{"$f":"G16+Calcul!$C$10*I16","v":105},{"$f":"H16+Calcul!$C$10*I16","v":180},{"$f":"Calcul!$C$5*0.4","v":0}]
[null,"F5","F5 - 1 SDB avec WC",62.2,11.8,{"$f":"D17+Calcul!$C$10*I17","v":62.2},{"$f":"45+30","v":75},{"$f":"135+30","v":165},15,{"$f":"G17+Calcul!$C$10*I17","v":75},{"$f":"H17+Calcul!$C$10*I17","v":165},{"$f":"Calcul!$C$5*0.4","v":0}]
[null,"F5","F5 - 1 SDB + 1 WC indépendant",61.6,11.8,{"$f":"D18+Calcul!$C$10*I18","v":61.6},{"$f":"45+30+30","v":105},{"$f":"135+30+30","v":195},15,{"$f":"G18+Calcul!$C$10*I18","v":105},{"$f":"H18+Calcul!$C$10*I18","v":195},{"$f":"Calcul!$C$5*0.4","v":0}]
[null,"F6","F6 - 1SDB avec WC + 1 WC",79.8,11.8,{"$f":"D19+Calcul!$C$10*I19","v":79.8},{"$f":"45+30+30","v":105},{"$f":"135+30+30","v":195},15,{"$f":"G19+Calcul!$C$10*I19","v":105},{"$f":"H19+Calcul!$C$10*I19","v":195},{"$f":"Calcul!$C$5*0.4","v":0}]
[null,"F6","F6 - 1SDB avec WC + 1SDB",78.3,11.8,{"$f":"D20+Calcul!$C$10*I20","v":78.3},{"$f":"45+30+30","v":105},{"$f":"135+30+30","v":195},15,{"$f":"G20+Calcul!$C$10*I20","v":105},{"$f":"H20+Calcul!$C$10*I20","v":195},{"$f":"Calcul!$C$5*0.4","v":0}]
[null,"F6","F6 - 2 SDB + 1 WC",77.7,11.8,{"$f":"D21+Calcul!$C$10*I21","v":77.7},{"$f":"45+30+30+30","v":135},{"$f":"135+30+30+30","v":225},15,{"$f":"G21+Calcul!$C$10*I21","v":135},{"$f":"H21+Calcul!$C$10*I21","v":225},{"$f":"Calcul!$C$5*0.4","v":0}]
[null,"F7","F7 - 2 SDB + 1 WC",80.400000000000006,11.8,{"$f":"D22+Calcul!$C$10*I22","v":80.400000000000006},{"$f":"45+30+30+30","v":135},{"$f":"135+30+30+30","v":225},15,{"$f":"G22+Calcul!$C$10*I22","v":135},{"$f":"H22+Calcul!$C$10*I22","v":225},{"$f":"Calcul!$C$5*0.4","v":0}]
[null,null,"Saisie manuelle des débits de ventilation"]
[null,null,null,"hygro","auto","double flux","naturelle",null,"calcul Q4",null,null,"volume =",{"$f":"40*2.5","v":100},"nombre appart",{"$f":"Saisies!E10","v":0}]
[null,null,"débit hygro mini",{"$f":"(VLOOKUP(Calcul!C9,Ventilation!C6:K22,4,)*O24)+I27","v":{"$error":"#N/A"}},{"$f":"(VLOOKUP(Calcul!C9,Ventilation!C5:K22,8,)*O24)+I27","v":{"$error":"#N/A"}},{"$f":"0.8*Calcul!C5+I27","v":{"$error":"#N/A"}},{"$f":"G26","v":{"$error":"#N/A"}},null,{"$f":"IF(Chauffage!H20=0,IF(Saisies!$H$92<>0,Saisies!$H$92,INDEX('surface auto'!C21:C24,'surface auto'!A21,1)),1)","v":3},null,null,null,{"$f":"I27+D25","v":{"$error":"#N/A"}}]
[null,null,"débit hygro maxi",{"$f":"(VLOOKUP(Calcul!C9,Ventilation!C5:K22,4,)*O24)+I27","v":{"$error":"#N/A"}},{"$f":"(VLOOKUP(Calcul!C9,Ventilation!C5:K22,9,)*O24)+I27","v":{"$error":"#N/A"}},{"$f":"0.8*Calcul!C5+Ventilation!I27","v":{"$error":"#N/A"}},{"$f":"(VLOOKUP(Calcul!C9,Ventilation!C6:L22,10,)*O24)+I27","v":{"$error":"#N/A"}},null,{"$f":"IF('surface auto'!AA18=0,Calcul!C14-'surface auto'!AK16,Calcul!C14-'surface auto'!AC13)","v":{"$error":"#N/A"}},"at bat sans plancher"]
[null,null,null,null,null,null,null,null,{"$f":"I26*I25/1.6","v":{"$error":"#N/A"}},"m3/h"]
[]
[null,null,"heures pointe",null,null,"W thc","kwh/an"]
[null,null,"double flux",1,8760,60,{"$f":"(F30/1000)*24*365","v":525.6}]
[null,null,"simple flux hygro",0,8760,20,{"$f":"(F31/1000)*24*365","v":175.2}]
[null,null,"simple flux auto",0,1000,35,{"$f":"(F32/1000)*24*365","v":306.60000000000002}]
[null,null,"naturelle",0,4300,0]
[null,null,null,null,null,null,null,"débit pointe","débit base"]
[null,null,"vmc double flux avec échangeur",0,8760,{"$f":"IF($L$38<>0,$L$38,60)","v":60},{"$f":"(E35*F35/1000)*Saisies!$E$10","v":0},{"$f":"IF(AND($L$39<>\"\",Saisies!$E$12=\"Saisie manuelle des débits de ventilation\"),$L$39,F26)","v":{"$error":"#N/A"}},{"$f":"IF(AND($M$39<>\"\",Saisies!$E$12=\"Saisie manuelle des débits de ventilation\"),$M$39,F25)","v":{"$error":"#N/A"}}]
[null,null,"vmc double flux sans échangeur",0,8760,{"$f":"IF($L$38<>0,$L$38,35)","v":35},{"$f":"(E36*F36/1000)*Saisies!$E$10","v":0},{"$f":"IF(AND($L$39<>\"\",Saisies!$E$12=\"Saisie manuelle des débits de ventilation\"),$L$39,F26)","v":{"$error":"#N/A"}},{"$f":"IF(AND($M$39<>\"\",Saisies!$E$12=\"Saisie manuelle des débits de ventilation\"),$M$39,F25)","v":{"$error":"#N/A"}},null,null,"POINTE","BASE"]
[null,null,"Extracteur mécanique sur conduit existant",0,8760,{"$f":"IF($L$38<>0,$L$38,40)","v":40},{"$f":"(E37*F37/1000)*Saisies!$E$10","v":0},{"$f":"IF(AND($L$39<>\"\",Saisies!$E$12=\"Saisie manuelle des débits de ventilation\"),$L$39,G26)","v":{"$error":"#N/A"}},{"$f":"IF(AND($M$39<>\"\",Saisies!$E$12=\"Saisie manuelle des débits de ventilation\"),$M$39,G25)","v":{"$error":"#N/A"}},null,"forcer débit ventilation",{"$f":"Saisies!H95","v":0},{"$f":"Saisies!G95","v":0}]
[null,null,"vmc hygro A",0,8760,{"$f":"IF($L$38<>0,$L$38,20)","v":20},{"$f":"(E38*F38/1000)*Saisies!$E$10","v":0},{"$f":"IF(AND($L$39<>\"\",Saisies!$E$12=\"Saisie manuelle des débits de ventilation\"),$L$39,D26)","v":{"$error":"#N/A"}},{"$f":"IF(AND($M$39<>\"\",Saisies!$E$12=\"Saisie manuelle des débits de ventilation\"),$M$39,D25)","v":{"$error":"#N/A"}},null,"wthc",{"$f":"Saisies!H96","v":0},{"$f":"+L38","v":0}]
[null,null,"vmc hygro B",0,8760,{"$f":"IF($L$38<>0,$L$38,20)","v":20},{"$f":"(E39*F39/1000)*Saisies!$E$10","v":0},{"$f":"IF(AND($L$39<>\"\",Saisies!$E$12=\"Saisie manuelle des débits de ventilation\"),$L$39,D26*1.2)","v":{"$error":"#N/A"}},{"$f":"IF(AND($M$39<>\"\",Saisies!$E$12=\"Saisie manuelle des débits de ventilation\"),$M$39,D25*1.2)","v":{"$error":"#N/A"}},null,"tot",{"$f":"L37+I27","v":{"$error":"#N/A"}},{"$f":"M37+I27","v":{"$error":"#N/A"}}]
[null,null,"vmc hygro gaz",0,8760,{"$f":"IF($L$38<>0,$L$38,20)","v":20},{"$f":"(E40*F40/1000)*Saisies!$E$10","v":0},{"$f":"IF(AND($L$39<>\"\",Saisies!$E$12=\"Saisie manuelle des débits de ventilation\"),$L$39,D26*1.1)","v":{"$error":"#N/A"}},{"$f":"IF(AND($M$39<>\"\",Saisies!$E$12=\"Saisie manuelle des débits de ventilation\"),$M$39,D25*1.1)","v":{"$error":"#N/A"}}]
[null,null,"vmc autoréglable avant 1982",0,8760,{"$f":"IF($L$38<>0,$L$38,35)","v":35},{"$f":"(E41*F41/1000)*Saisies!$E$10","v":0},{"$f":"IF(AND($L$39<>\"\",Saisies!$E$12=\"Saisie manuelle des débits de ventilation\"),$L$39,E26)","v":{"$error":"#N/A"}},{"$f":"IF(AND($M$39<>\"\",Saisies!$E$12=\"Saisie manuelle des débits de ventilation\"),$M$39,E25)","v":{"$error":"#N/A"}}]
[null,null,"vmc autoréglable après 1982",0,8760,{"$f":"IF($L$38<>0,$L$38,35)","v":35},{"$f":"(E42*F42/1000)*Saisies!$E$10","v":0},{"$f":"IF(AND($L$39<>\"\",Saisies!$E$12=\"Saisie manuelle des débits de ventilation\"),$L$39,E26/1.2)","v":{"$error":"#N/A"}},{"$f":"IF(AND($M$39<>\"\",Saisies!$E$12=\"Saisie manuelle des débits de ventilation\"),$M$39,E25/1.2)","v":{"$error":"#N/A"}}]
[null,null,"ventilation naturelle tirage thermique",0,4300,0,0,{"$f":"IF(AND($L$39<>\"\",Saisies!$E$12=\"Saisie manuelle des débits de ventilation\"),$L$39,G26)","v":{"$error":"#N/A"}},{"$f":"IF(AND($M$39<>\"\",Saisies!$E$12=\"Saisie manuelle des débits de ventilation\"),$M$39,G25)","v":{"$error":"#N/A"}}]
[null,null,"ventilation par entrées d'air hautes et basses",0,4300,0,0,{"$f":"IF(AND($L$39<>\"\",Saisies!$E$12=\"Saisie manuelle des débits de ventilation\"),$L$39,G26)","v":{"$error":"#N/A"}},{"$f":"IF(AND($M$39<>\"\",Saisies!$E$12=\"Saisie manuelle des débits de ventilation\"),$M$39,G25)","v":{"$error":"#N/A"}}]
[null,null,"Ventilation par ouverture des fenêtres",0,4300,0,0,{"$f":"IF(AND($L$39<>\"\",Saisies!$E$12=\"Saisie manuelle des débits de ventilation\"),$L$39,((G26-I27)/2)+I27)","v":{"$error":"#N/A"}},{"$f":"H45","v":{"$error":"#N/A"}}]
[null,null,"ventilation hybride",0,4300,{"$f":"IF($L$38<>0,$L$38,15)","v":15},{"$f":"(E46*F46/1000)*Saisies!$E$10","v":0},{"$f":"IF(AND($L$39<>\"\",Saisies!$E$12=\"Saisie manuelle des débits de ventilation\"),$L$39,E26*1.2)","v":{"$error":"#N/A"}},{"$f":"IF(AND($M$39<>\"\",Saisies!$E$12=\"Saisie manuelle des débits de ventilation\"),$M$39,E25*1.2)","v":{"$error":"#N/A"}}]
[null,null,{"$f":"\"\"","v":""}]
[]
[null,null,"Saisie simplifiée"]
[null,null,"VMC double flux sans échangeur",0,1000,35,307,{"$f":"F26","v":{"$error":"#N/A"}},{"$f":"F26","v":{"$error":"#N/A"}}]
[null,null,"Extracteur mécanique sur conduit existant",0,1000,35,307,{"$f":"F25","v":{"$error":"#N/A"}},{"$f":"F25","v":{"$error":"#N/A"}}]
[null,null,"VMC Hygroréglable",0,8760,20,175,{"$f":"D26","v":{"$error":"#N/A"}},{"$f":"D25","v":{"$error":"#N/A"}}]
[null,null,"VMC Autoréglable",0,1000,35,307,{"$f":"E26","v":{"$error":"#N/A"}},{"$f":"E25","v":{"$error":"#N/A"}}]
[null,null,"Ventilation naturelle",0,4300,0,0,{"$f":"G26","v":{"$error":"#N/A"}},{"$f":"G25","v":{"$error":"#N/A"}}]

{"sheet":"ECS","index":19,"n_rows":151,"n_cols":14,"rows_kept":151,"cut":false,"hidden":true,"merged":[[131,1,131,2],[123,0,123,2],[123,3,123,4],[123,5,123,9],[77,3,77,6],[78,3,78,6],[79,3,79,6],[104,3,104,6],[105,3,105,6],[106,3,106,6]]}
[null,"Consommation annuelle d'eau chaude sanitaire"]
[]
[null,"- encodez les données relatives à votre situation dans les cases bleues."]
[null,"- les résultats sont repris dans les cases jaunes."]
[]
["1. ","Evaluation des besoins d'eau à 60°C en m³/an"]
[]
["1.1.","Par ratio de bâtiment",null,"(sur base du fichier de données en Eau chaude sanitaire)"]
[]
[null,"Etablissement","Caractéristiques","Besoins en litres à 60°C",null,"Valeur ","Nombre d'unités","Nombre de jours","Total m³ à 60°C/an "]
[null,"Hotel","- 3 étoiles en montagne (sports d'hiver)","par chambre et par jour",170,170,0,0,{"$f":"+G11*F11*H11/1000","v":0},"m³/an"]
[null,null,"- 3 étoiles tous lieux","par chambre et par jour","130 à 140",135,0,0,{"$f":"+G12*F12*H12/1000","v":0},"m³/an"]
[null,null,"- hôtel de vacances à la semaine avec bain","par chambre et par jour",100,100,0,0,0,"m³/an"]
[null,null,"- 1 étoile avec douche (50%) et bain (50%)","par chambre et par jour",75,75,0,0,0,"m³/an"]
[null,null,"- lingerie","par kg de linge sec","4 à 5",4.5,0,0,0,"m³/an"]
[null,"Restaurant","150 à 50 repas par jour","par repas","12 à 20",16,0,0,0,"m³/an"]
[null,"Bureaux","En absence de douches, restaurant, …","par personne et par jour","2 à 6",0.9,{"$f":"IF('BDD typo'!A1=9,Saisies!E21,0)","v":{"$error":"#N/A"}},{"$f":"+Calcul!C27","v":330},{"$error":"#N/A"},"m³/an"]
[null,"Grande cuisine","cuisine à liaison froide","par repas","2 à 3",2.5,0,0,0,"m³/an"]
[null,"Ecole","- chambre d'internat","par lit et par jour","30 à 40",35,0,0,0,"m³/an"]
[null,null,"- Repas, hors lave-v.","par repas","3 à 5",4,0,0,0,"m³/an"]
[null,null,"- Repas, avec lave-v.","par repas","9 à 10",9.5,0,0,0,"m³/an"]
[null,"Maison de retraite","- chambre","par lit et par jour",40,40,0,0,0,"m³/an"]
[null,null,"- Repas, hors lave-v.","par repas","3 à 5",4,0,0,0,"m³/an"]
[null,null,"- Repas, avec lave-v.","par repas","9 à 10",9.5,0,0,0,"m³/an"]
[null,"Maternité","- chambre","par lit et par jour",60,60,0,0,0,"m³/an"]
[null,null,"- Cuisine, avec lave-v.","par repas","10 à 15",12.5,0,0,0,"m³/an"]
[null,"Hôpitaux","- chambre","par lit et par jour","50 à 60",55,0,0,0,"m³/an"]
[null,null,"- Cuisine, avec lave-v. (de 1 700 à 300 repas par jour)","par repas","8 à 12",10,0,0,0,"m³/an"]
[null,"Foyer pour handicapés","- chambre","par lit et par jour",100,100,0,0,0,"m³/an"]
[null,null,"- Cuisine, avec lave-v.","par repas","9 à 10",9.5,0,0,0,"m³/an"]
[null,"Centre d'Aide par le Travail","- chambre","par lit et par jour",60,60,0,0,0,"m³/an"]
[null,null,"- Cuisine, avec lave-v.","par repas","9 à 10",9.5,0,0,0,"m³/an"]
[null,"Camping","- 3 et 4 étoiles","par campeur et par jour",12,12,0,0,0,"m³/an"]
[null,null," ","par emplacement et par jour",45,45,0,0,0,"m³/an"]
[null,"Villa familiale","standard simple","par personne et par jour",35,{"$f":"Calcul!C24","v":35},{"$f":"IF('BDD typo'!A1<9,Saisies!E21,0)","v":{"$error":"#N/A"}},{"$f":"+Calcul!C27","v":330},{"$f":"IF(Saisies!E10>1,0,+G35*F35*H35/1000)","v":{"$error":"#N/A"}},"m³/an"]
[null,"Appartement","standard moyen","par personne et par jour",40,35,{"$f":"+Saisies!E10*Saisies!E21","v":0},{"$f":"+H35","v":330},{"$f":"IF(Saisies!E10>1,G36*F36*H36/1000,0)","v":0},"m³/an"]
[null,"Immeuble d'appartements en location"," ","par personne et par jour",35,35,0,0,0,"m³/an"]
[null,"(mais des valeurs moitié de celles-ci ont été mesurées dans les immeubles HLM en France).",null,null,null,null,null,"TOTAL :",{"$f":"SUM(I11:I37)","v":{"$error":"#N/A"}},"m³/an à 60°C"]
[]
[]
["1.2.","Par ratio de point de puisage",null,"(sur base du fichier de données en Eau chaude sanitaire)"]
[]
[null," ",null,"Litres par utilisateur à 45°C  ","Litres par util. à 60°c","Valeur choisie","Nombre d'unités","Nombre d'util. par an","Total m³ à 60°C/an "]
[null,"Industrie","Lavabo individuel",22,15,15,0,0,{"$f":"+G44*F44*H44/1000","v":0},"m³/an"]
[null,null,"Lavabo-auge collectif",null," "]
[null,null,"- à robinet","11 à  22","8 à 15",11.5,0,0,{"$f":"+G46*F46*H46/1000","v":0},"m³/an"]
[null,null,"- à pissette","6 à 10","5 à 8",6.5,0,0,{"$f":"+G47*F47*H47/1000","v":0},"m³/an"]
[null,null,"lavabo collectif circulaire"]
[null,null,"- à 6 places",43,30,30,0,0,{"$f":"+G49*F49*H49/1000","v":0},"m³/an"]
[null,null,"- à 10 places",54,38,38,0,0,0,"m³/an"]
[null,null,"Douche commune",36,25,25,0,0,0,"m³/an"]
[null,null,"Douche en cabine, travail peu salissant",50,35,35,0,0,0,"m³/an"]
[null,null,"Douche en cabine, travail très salissant",60,42,42,0,0,0,"m³/an"]
[null,null,"Baignoire",180,125,125,0,0,0,"m³/an"]
[null,null,"Valeur moyenne y compris les besoins de cuisine","50 l par jour et par personne",null,50,0,0,0,"m³/an"]
[null,"Ecoles","Douches en milieu scolaire",35,25,25,0,0,{"$f":"+G56*F56*H56/1000","v":0},"m³/an"]
[null,"Bât. Sportif","Douches en centre sportif",60,42,42,0,0,{"$f":"+G57*F57*H57/1000","v":0},"m³/an"]
[null,"Hébergement","Baignoire normale",150,105,105,0,0,{"$f":"+G58*F58*H58/1000","v":0},"m³/an"]
[null,null,"Grande baignoire",180,125,125,0,0,{"$f":"+G59*F59*H59/1000","v":0},"m³/an"]
[null,null,"Baignoire d'hydrothérapie",300,210,210,0,0,{"$f":"+G60*F60*H60/1000","v":0},"m³/an"]
[null,null,null,null,null,null,null,"TOTAL :",{"$f":"SUM(I44:I60)","v":0},"m³/an à 60°C"]
[]
["1.3.","Par évaluation directe à chaque point de puisage"]
[]
[null,"Poste","Consommation en litres/semaine","Nombre de semaines","Nombre de postes","T° de puisage",null,"Quantité tot. en m³/an","Quantité équiv. à 60°C en m³/an"]
[null,"evier",null,null,null,null,null,{"$f":"+C66*D66*E66/1000","v":0},{"$f":"+H66*(F66-10)/(60-10)","v":0},"m³/an"]
[null,"lavabo",null,null,null,null,null,0,0,"m³/an"]
[null,"douche",null,null,null,null,null,0,0,"m³/an"]
[null,"bain",null,null,null,null,null,0,0,"m³/an"]
[null,"autre…",null,null,null,null,null,0,0,"m³/an"]
[null,"autre…",null,null,null,null,null,0,0,"m³/an"]
[null,null,null,null,null,null,null,"TOTAL :",{"$f":"SUM(I66:I71)","v":0},"m³/an à 60°C"]
[]
[]
[]
[]
["2. ","Evaluation du besoin annuel net de chaleur pour l'eau chaude sanitaire"]
[null,null,null,"température stockage :",null,null,null,null,{"$f":"Calcul!C26","v":55},"°C"]
[null,null,null,"Quantité d'eau chaude retenue sur base de 1. :   ",null,null,null,null,{"$f":"IF(I38>0,I38,IF(I61>0,I61,I72))","v":{"$error":"#N/A"}},"m³/an"]
[null,null,null,"Quantité d'énergie correspondante : ",null,null,null,null,{"$f":"+I79*1.163*(I78-N115)","v":{"$error":"#N/A"}},"kWh/an"]
[]
[]
[]
["3. ","Evaluation de la consommation annuelle correspondante"]
[]
[]
["3.2.","sur base des différents pertes des équipements et tuyauteries"]
[]
[null,"Pertes du ballon accumulateur (voir prog. calcul \"isolation ballon\")",null,null,null,null,null,"-->",{"$f":"IF(Chauffage!H20=1,IF(Chauffage!A164=6,0,I130),I130)*Saisies!E10","v":0},"kWh/an",{"$f":"L130*Saisies!E10","v":{"$error":"#VALUE!"}}]
[null,"Pertes de la tuyauterie de circulation (voir prog. calcul \"isolation tuyauteries\")",null,null,null,null,null,"-->",{"$f":"D128","v":{"$error":"#N/A"}},"kWh/an",{"$f":"I90*M129","v":{"$error":"#N/A"}}]
[null,"Pertes d'eau chaude bloquée dans les tuyaux après usage (voir calcul \"temps d'attente\")",null,null,null,null,1,"-->",{"$f":"IF(G91=0,0,B130)","v":0},"kWh/an",{"$f":"I91*M129","v":{"$error":"#VALUE!"}}]
[null,"Pertes par veilleuse (consommation de 700 à 1200 kWh/an, suivant la flamme)",null,null,null,null,null,"-->",0,"kWh/an"]
[]
[null,"Demande nette en eau chaude + pertes diverses",null,null,null,null,null,null,{"$f":"SUM(I89:I92)","v":{"$error":"#N/A"}},"kWh/an",{"$f":"SUM(K89:K91)","v":{"$error":"#VALUE!"}}]
[]
[]
[]
[]
[]
[]
[null,null,null,null,null,null,null,null,null,null,null,1]
[null,null,null,null,null,null,null,null,null,null,null,2,"lié au chauffage sans stockage"]
[null,null,null,null,null,null,null,null,null,null,null,3,"lié au chauffage avec stockage"]
[null,null,null,null,null,null,null,null,null,null,null,4,"chauffe bain gaz"]
[null,null,null,"Rendement de production sélectionné :",null,null,null,null,{"$f":"'surface auto'!I10/100","v":{"$error":"#VALUE!"}},null,null,5,"ballon électrique"]
[null,null,null,"Consommation annuelle correspondante : ",null,null,null,null,{"$f":"(I94+I80)/I105","v":{"$error":"#N/A"}},"kWh/an",null,6,"Solaire avec appoint élec"]
[null,null,null,"Rendement annuel global correspondant :",null,null,null,null,{"$f":"I80/I106","v":{"$error":"#N/A"}},null,null,7,"Chauffe eau thermodynamique"]
[]
[]
[]
["Données climatiques"]
["Température de l'arrivée d'eau froide",1,2,3,4,5,6,7,8,9,10,11,12,"moy"]
["H1a",5.8309677419354804,5.8651428571428577,7.1909032258064522,9.3479333333333354,11.866387096774199,13.9596,15.165290322580651,15.101935483870971,13.817933333333333,11.632193548387098,9.1525999999999996,7.0303870967741959,{"$f":"AVERAGE(B113:M113)","v":10.496772836661547}]
["H1b",5.8309677419354804,5.8651428571428577,7.1909032258064522,9.3479333333333354,11.866387096774199,13.9596,15.165290322580651,15.101935483870971,13.817933333333333,11.632193548387098,9.1525999999999996,7.0303870967741959,{"$f":"AVERAGE(B114:M114)","v":10.496772836661547}]
["H1c",5.8309677419354804,5.8651428571428577,7.1909032258064522,9.3479333333333354,11.866387096774199,13.9596,15.165290322580651,15.101935483870971,13.817933333333333,11.632193548387098,9.1525999999999996,7.0303870967741959,{"$f":"AVERAGE(B115:M115)","v":10.496772836661547}]
["H2a",7.3309677419354786,7.3651428571428568,8.6909032258064531,10.847933333333334,13.366387096774197,15.4596,16.665290322580649,16.601935483870971,15.317933333333336,13.132193548387098,10.6526,8.5303870967741915,11.996772836661544]
["H2b",7.3309677419354786,7.3651428571428568,8.6909032258064531,10.847933333333334,13.366387096774197,15.4596,16.665290322580649,16.601935483870971,15.317933333333336,13.132193548387098,10.6526,8.5303870967741915,11.996772836661544]
["H2c",7.3309677419354786,7.3651428571428568,8.6909032258064531,10.847933333333334,13.366387096774197,15.4596,16.665290322580649,16.601935483870971,15.317933333333336,13.132193548387098,10.6526,8.5303870967741915,11.996772836661544]
["H2d",7.3309677419354786,7.3651428571428568,8.6909032258064531,10.847933333333334,13.366387096774197,15.4596,16.665290322580649,16.601935483870971,15.317933333333336,13.132193548387098,10.6526,8.5303870967741915,11.996772836661544]
["H3",9.8309677419354777,9.8651428571428585,11.190903225806453,13.347933333333335,15.866387096774197,17.959600000000002,19.165290322580642,19.101935483870971,17.817933333333333,15.632193548387098,13.152600000000001,11.030387096774193,14.496772836661551]
[]
[]
[]
["eau perdue dans distrib",null,null,"pertes tubes instantané (10l/min)",null,"pertes ballon"]
["linéaire tube (0,2 * shab)",{"$f":"0.2*Saisies!E11","v":0},"m de tube",0.53,"kl",{"$f":"IF('surface auto'!I8=\"Chauffe bain gaz\",0,Calcul!N62)","v":{"$error":"#VALUE!"}},"litres","isolé?","oui"]
["diametre",1.2,"cm",{"$f":"D125*(I78-18)","v":19.61},"w/m",{"$f":"(PI()*1.5*(J132+J133))+(2*PI()*(J132^2)/4)","v":0.23561944901923448},"m²","Lambda Isolant",3.3000000000000002E-2,"W/m.K"]
["contenance (diam 16)",{"$f":"(+(3.14*(B126/2)*(B126/2))*(B125*100))/1000","v":0},"l",{"$f":"((I38*1000)/10)/60","v":{"$error":"#N/A"}},"h/an",{"$f":"I78","v":55},"°C","Epaisseur",5,"cm"]
["=",{"$f":"B127*0.001","v":0},"M3",{"$f":"D127*D126*B125/1000","v":{"$error":"#N/A"}},"kwh an",{"$f":"IF(Calcul!C28=\"non\",16,Calcul!N65)","v":16},"°C","Coefficient k ",{"$f":"IF(I125=\"non\",10,1/(I127/(I126*100)+0.1))","v":0.61913696060037515},"W/m².K"]
["occupation",{"$f":"Calcul!C27","v":330},"jours par an",null,null,8760,"heures","Puissance",{"$f":"IFERROR(I128*F126*(F127-F128),0)","v":5.6893476714400508},"W",null,{"$f":"Chauffage!R18*24","v":{"$error":"#VALUE!"}},{"$f":"L129/F129","v":{"$error":"#VALUE!"}}]
["conso eau perdue",{"$f":"(B128*1.163*(F127-20))*(((3*Calcul!C23)*B129))","v":0},"kwh/an",null,null,null,null,"Déperdition annuelle",{"$f":"F129*I129/1000","v":49.838685601814845},"kWh/an","apport recup",{"$f":"L129*I129/1000","v":{"$error":"#VALUE!"}}]
[]
[null,"PUISSANCE BALLON",null,null,null,null,null,50,0.4,{"$f":"IFERROR((VLOOKUP(F125,H132:I152,2,FALSE)),0)","v":0}]
[null,"volume ballon",{"$f":"+F125","v":{"$error":"#VALUE!"}},null,null,null,null,100,{"$f":"I132-0.014","v":0.38600000000000001},{"$f":"I127/100","v":0.05}]
[null,"Puissance pour montée en T°",{"$f":"(+C133*4.18*(I78-N115))/3600","v":{"$error":"#VALUE!"}},null,null,null,null,150,{"$f":"I133-0.014","v":0.372}]
[null,"temps de montée en température en h",4,null,null,null,null,200,{"$f":"I134-0.014","v":0.35799999999999998}]
[null,"Puissance ballon ",{"$f":"C134/C135","v":{"$error":"#VALUE!"}},null,null,null,null,250,0.34399999999999997]
[null,null,null,null,null,null,null,300,0.32999999999999996]
[null,null,null,null,null,null,null,350,0.31599999999999995]
[null,null,null,null,null,null,null,400,0.30199999999999994]
[null,null,null,null,null,null,null,450,0.28799999999999992]
[null,null,null,null,null,null,null,500,0.27399999999999991]
[null,null,null,null,null,null,null,550,0.2599999999999999]
[null,null,null,null,null,null,null,600,0.24599999999999989]
[null,null,null,null,null,null,null,650,0.23199999999999987]
[null,null,null,null,null,null,null,700,0.21799999999999986]
[null,null,null,null,null,null,null,750,0.20399999999999985]
[null,null,null,null,null,null,null,800,0.18999999999999984]
[null,null,null,null,null,null,null,850,0.17599999999999982]
[null,null,null,null,null,null,null,900,0.16199999999999981]
[null,null,null,null,null,null,null,950,0.1479999999999998]
[null,null,null,null,null,null,null,1000,0.13399999999999979]

{"sheet":"RG","index":20,"n_rows":57,"n_cols":16,"rows_kept":57,"cut":false,"hidden":true,"merged":[]}
["Villes","Latitude","R. global","janvier","février","mars","avril","mai","juin","juillet","août","septembre","octobre","novembre","décembre","Coeff. piscine"]
["Agen",44.2,{"$f":"SUM(D2:O2)","v":1478.5},68.3,83,138,143,157,162,180,158,144,126,70.2,49,0.15]
["Ajaccio",41.9,1763.3,86,95.2,144,163,185,187,206,201,175,146,97,78.099999999999994,0.15]
["Ambérieu",46,1278.5,47.6,67.3,105,125,144,148,169,153,130,99.8,54.8,35,0.15]
["Angers",47.5,1337.1,53.3,62.5,126,146,161,154,168,143,112,105,63.3,43,0.1]
["Angoulème",45.6,1452.6,68.5,82.1,120,144,165,166,167,155,144,120,72.5,48.5,0.15]
["Annecy",46.2,1319,44.6,74.2,115,127,146,149,171,159,139,101,50.2,43,0.1]
["Bastia",42.7,1757,96,106,144,159,168,179,198,181,167,159,111,89,0.15]
["Besançon",47.3,1353.2,44.4,70.400000000000006,112,136,159,159,170,157,135,109,57.4,44,0.1]
["Biarritz",43.5,1418.3000000000002,62,84.9,125,137,156,155,161,155,138,118,71.900000000000006,54.5,0.15]
["Bordeaux",44.8,1461.1,59.4,85.7,126,147,161,164,173,167,141,118,66.599999999999994,52.4,0.15]
["Bourges",47.1,1313.1,45.3,69.3,112,137,152,153,164,151,131,105,55.2,38.299999999999997,0.1]
["Brest",48.4,1247.6999999999998,45.7,70.900000000000006,104,128,146,148,158,138,120,94.1,54.2,40.799999999999997,0.1]
["Caen",49.2,1316.6000000000001,46.7,64.8,122,134,157,158,161,151,123,102,57.4,39.700000000000003,0.1]
["Carcassonne",43.2,1546.8999999999999,83.1,94.8,139,139.69999999999999,166,147,171,187,160,125,70.599999999999994,63.7,0.15]
["Cazaux",44.5,1535.1000000000001,75,89,147,147,164,164,178,162,147,134,73.400000000000006,54.7,0.15]
["Chartres",48.4,1229.8999999999999,41.6,65.2,107,130,148,152,153,131,133,86.9,48.1,34.1,0.1]
["Clermont-Fd",45.8,1376.5,55.2,74.8,117,135,153,153,168,157,138,110,66.2,49.3,0.15]
["Cognac",45.7,1403.1,59.2,63.6,116,141,157,159,169,173,131,118,64.2,52.1,0.15]
["Colmar",48,1300.2,48.8,70.3,109,136,148,148,161,149,136,94.5,59.2,40.4,0.1]
["Dijon",47.3,1292.9000000000001,48.3,71.900000000000006,108,135,145,149,164,148,137,98.7,50.8,37.200000000000003,0.1]
["Embrun",44.6,1667.6999999999998,86.1,103,145,155,172,170,188,179,165,138,89.5,77.099999999999994,0.15]
["Gourdon",43.7,1427.6000000000001,57.2,84,122,138,158,160,173,162,139,117,63.4,54,0.15]
["Grenoble",45.2,1429.3,59.8,80.7,122,141,165,162,177,171,143,105,59.2,43.6,0.15]
["La Rochelle",46.2,1542.4,58.3,88.9,131,156,177,177,187,177,147,121,65.5,56.7,0.1]
["Langres",47.8,1321.3,47.9,68.400000000000006,115,132,157,155,164,152,133,106,51.3,39.700000000000003,0.1]
["Le Mans",48,1361.9,51.3,68.2,119,143,160,161,169,157,131,104,57.5,40.9,0.1]
["Le Puy-en-Velay",45,1428.7000000000003,60.3,78.099999999999994,118,138,159,158,177,165,147,113,67.900000000000006,47.4,0.15]
["Lille",50.6,1194.4000000000001,31.9,71.900000000000006,104,128,151,146,146,139,111,89.2,46.7,29.7,0.1]
["Limoges",45.8,1368.5,53.2,77.7,113,135,155,156,165,158,136,111,64,44.6,0.15]
["Lyon",45.8,1421.3000000000002,45.9,75.3,121,145,168,166,180,168,142,105,62.7,42.4,0.15]
["Marseille",43.3,1739.8,82.8,106,146,168,184,184,202,195,167,137,95.3,72.7,0.15]
["Metz",49,1178.9000000000001,36.299999999999997,59.9,100,121,147,147,151,139,119,81,47.7,30,0.1]
["Millau",44.1,1597.6000000000001,72.5,97.4,136,143,159,167,196,178,157,137,83.7,71,0.15]
["Mont de Marsan",43.9,1426.8,60,86,127,140,156,154,166,158,138,119,68.8,54,0.15]
["Montélimar",44.5,1685,76.7,96.3,143,166,175,182,202,186,167,139,85.5,66.5,0.15]
["Montpellier",43.6,1704.6,84.6,106,143,165,179,180,198,188,162,131,95,73,0.15]
["Mulhouse",47.6,1188.2,46.6,65.8,94.7,108,134,140,159,147,119,87.6,47.6,38.9,0.1]
["Nancy",48.7,1246,46,67.3,102,130,145,149,160,148,133,86.5,45.4,33.799999999999997,0.1]
["Nantes",47.2,1368.8999999999999,53.8,71.8,115,142,161,160,167,156,131,106,61.5,43.8,0.1]
["Nice",43.7,1751.4,88.2,109,147,166,179,179,202,193,168,145,95.7,79.5,0.15]
["Nimes",43.8,1748.4,89.8,107,150,166,172,184,205,189,160,146,96.4,83.2,0.15]
["Orléans",47.9,1313,42.6,68.900000000000006,114,138,158,158,163,152,128,98.8,52.2,39.5,0.1]
["Paris",48.8,1229.6999999999998,34.799999999999997,64.400000000000006,107,128,149,153,155,144,121,90.1,48.3,35.1,0.1]
["Perpignan",42.7,1690,92.1,111,148,163,172,169,187,179,156,131,98.9,83,0.15]
["Reims",49.3,1265.5,43.8,63,107,135,156,153,157,145,124,95,50.3,36.4,0.1]
["Rennes",48.1,1351.6,46.7,69.400000000000006,111,139,158,158,192,152,127,100,58.3,40.200000000000003,0.1]
["Rouen",49.4,1219.9000000000001,33,63.7,106,129,151,151,153,141,120,87.9,49.7,34.6,0.1]
["Saint Auban",44.4,1753.1999999999998,97.3,121,106,172,185,183,200,194,173,141,98.1,82.8,0.15]
["Saint Quentin",49.8,1214.1000000000001,36.6,57.6,99.4,128,152,152,152,140,117,96.9,48.7,33.9,0.1]
["Sarreguemines",49.1,1149.3,36.9,65.8,95,113,135,139,147,137,126,80,45.5,29.1,0.1]
["Strasbourg",48.6,1231.6999999999998,35.200000000000003,61.7,106,129,149,148,157,150,124,87.6,46.6,37.6,0.1]
["Toulon",43.1,1855,102,111,155,176,184,188,205,193,172,158,108,103,0.15]
["Toulouse",43.6,1741.6,88.6,105,148,168,173,184,207,188,159,141,93.5,86.5,0.15]
["Tours",47.4,1307.2,44.9,72,111,136,147,154,168,148,130,98.5,56.6,41.2,0.1]
["Valenciennes",50.4,1048.3,33.1,55.1,83.2,109,132,128,132,124,101,80.2,41.3,29.4,0.1]
["Vichy",46.1,1296.2,56.4,69.7,103,125,140,150,166,150,133,103,58.4,41.7,0.1]

{"sheet":"macro","index":21,"n_rows":9,"n_cols":12,"rows_kept":9,"cut":false,"hidden":false,"merged":[]}
[]
[]
[]
[]
[]
[]
[null,null,null,null,null,null,null,null,null,null,null,"Ce classeur ne contient pas de virus ni de code malveillant,"]
[null,null,null,null,null,null,null,null,null,null,null,"mais son utilisation nécéssite l'activation des macros"]
[null,null,null,null,null,null,null,null,null,null,null,"Merci de valider les deux messages ci-dessous s'ils apparaissent en haut de cette fenêtre"]